program: Orca
programVersion: 4.2.1
elementType: Cl Cl O N N C C C C C C C C C C C C C C H H H H H H H H H H H H
charge: 0
multiplicity: 1
keywords: wb97x-d3
keywords: def2-TZVPP
keywords: def2/J RIJCOSX GRIDX6 NOFINALGRIDX
keywords: grid4 nofinalgrid
keywords: scfconv7
keywords: smallprint printgap noloewdin
keywords: NOSOSCF
formula: C14H12Cl2N2O
InChI: InChI=1S/C14H12Cl2N2O/c1-19-18-14(7-10-3-2-6-17-9-10)12-5-4-11(15)8-13(12)16/h2-6,8-9H,7H2,1H3
31 atoms
Cl -0.09873 0.496415 1.893269
Cl -4.492775 -1.963124 0.092413
O  3.44396 -0.943712 0.069459
N  2.145459 -1.30208 0.267491
N  -0.14066 3.488377 -0.901066
C  1.678267 0.268774 -1.600783
C  1.338308 -0.732787 -0.526727
C  -0.099009 -1.043358 -0.334667
C  1.396273 1.657638 -1.092921
C  -0.839285 -0.530993 0.726614
C  -0.761001 -1.838026 -1.265137
C  2.304972 2.331173 -0.286469
C  0.188476 2.291708 -1.36148
C  -2.191486 -0.809173 0.863644
C  -2.106355 -2.135316 -1.147271
C  -2.812553 -1.613396 -0.075382
C  1.97437 3.584439 0.196292
C  0.737229 4.117532 -0.136547
C  4.271851 -1.638078 0.976412
H  2.719144 0.176051 -1.907791
H  1.059603 0.067732 -2.478392
H  -0.201717 -2.244573 -2.098447
H  3.253551 1.87267 -0.036714
H  -0.552618 1.798754 -1.984528
H  -2.750402 -0.39813 1.691856
H  -2.598955 -2.763377 -1.875637
H  2.658014 4.139956 0.823599
H  0.444575 5.095828 0.228947
H  4.213509 -2.719444 0.833512
H  4.020674 -1.405102 2.013569
H  5.288673 -1.307193 0.772232
totalener: -1645.84350530 hartree
nucrepener: 1636.93710104 hartree
electener: -3282.78060634 hartree
oneelecener: -5509.50771412 hartree
twoeener: 2226.72710778 hartree
kineticenergy: 1641.48631288 hartree
xcener: -112.972281085623 hartree
chargesum: -0.0000000
charge: -0.052698 -0.067143 -0.213662 -0.079210 -0.277017 -0.073374 0.074434 0.046060 0.019277 0.023688 -0.130817 -0.142502 -0.052299 -0.145912 -0.166582 0.100632 -0.100586 0.003022 -0.115162 0.107611 0.103107 0.128020 0.122634 0.100846 0.116150 0.124272 0.122767 0.117860 0.102290 0.102725 0.101572
qa: -0.0527 -0.0671 -0.2137 -0.0792 -0.2770 -0.0734 0.0744 0.0461 0.0193 0.0237 -0.1308 -0.1425 -0.0523 -0.1459 -0.1666 0.1006 -0.1006 0.0030 -0.1152 0.1076 0.1031 0.1280 0.1226 0.1008 0.1161 0.1243 0.1228 0.1179 0.1023 0.1027 0.1016
va: 1.2631 1.2377 1.9640 2.9028 3.1024 3.8247 3.8758 3.6563 3.5747 3.9708 3.9549 3.9924 4.1009 4.0799 4.0573 3.9352 3.8969 4.0316 3.9087 1.0337 1.0119 1.0061 1.0219 1.0113 1.0247 1.0128 1.0006 1.0009 0.9975 0.9971 0.9953
dispcorr: -0.016476652 hartree
energy: -1645.859981951268
dipole: 22.71946 -21.53921 1.18025 3.76331 -4.24273 -0.47942 -6.37169 6.09348 -0.27821
magnitude: 1.30393 au
magnitude: 3.31434 debye
