program: Gaussian 09
title: 000034341
version: EM64L-G09RevD.01
frameworkgroup: C1[X(C15H9N)]
method: RPBEPBE
basis: SDD
operation: Freq
keyword: #pfreq=noraman
keyword: PBEPBE/SDD
title: #p freq=noraman PBEPBE/SDD
converged: NO YES NO NO
title: Mulliken charges:
elementType: N C C C C C C C C C C C C C C C H H H H H H H H H
charge: -0.022019 0.400565 0.420250 0.402264 0.399789 -0.648570 -0.645686 -0.564498 -0.407257 -0.415407 -0.415259 0.403199 -0.391114 -0.238576 -0.236679 -0.267069 0.249964 0.248778 0.267247 0.247926 0.244820 0.243982 0.257910 0.232852 0.232589
chargesum: 0.00000
title: Mulliken charges with hydrogens summed into heavy atoms:
elementType: N C C C C C C C C C C C C C C C
charge: -0.022019 0.400565 0.420250 0.402264 0.399789 -0.398606 -0.396908 -0.297251 -0.159331 -0.170587 -0.171277 0.403199 -0.133204 -0.005724 -0.004091 -0.267069
polarizability: 3.53585185e+02 -2.36241205e+00 1.61837648e+02 2.67985965e-03 3.05417134e-03 6.20247305e+01
1716.lowfreq: -6.9777 -2.4785 -0.0006 0.0002 0.0007 7.5467 60.3828 109.9717 115.8341
frequency: 60.3712 109.9713 115.8312 152.2903 236.2239 246.9973 279.0191 330.2867 378.1572 381.7122 461.8473 473.0807 475.2637 476.1443 549.5227 550.5541 562.9212 617.8370 644.2143 648.2962 735.3146 749.0333 756.3041 760.3822 794.1575 819.9857 828.8393 859.3986 889.7763 900.4363 923.2212 947.1260 953.7240 972.4684 983.9280 994.6820 1014.4881 1113.1457 1157.7216 1162.9204 1174.2584 1189.1602 1203.0100 1274.7752 1284.1638 1288.1714 1298.9892 1354.8849 1396.4556 1426.6326 1431.2767 1439.7620 1457.6027 1482.7585 1541.3496 1562.1915 1586.0231 1631.0344 1636.8478 2169.6763 3119.7472 3122.6682 3123.2036 3128.1074 3132.5646 3145.1432 3145.9144 3164.4428 3167.2355
redmass: 6.8750 4.2931 9.3076 5.4252 5.2613 4.8362 4.6237 8.7060 3.3112 5.1249 5.3442 2.4785 6.6151 2.7512 7.9932 3.8439 6.6767 6.6162 3.4340 7.0156 6.6316 5.5828 1.3762 2.7398 2.1761 3.7737 1.4059 1.3831 1.4891 5.5662 1.6265 1.8730 4.0106 1.4051 1.3916 1.3547 2.3332 2.0482 1.4771 2.0047 1.0916 1.4623 1.2976 1.9717 1.8313 2.1218 2.2823 1.8884 3.3388 3.0985 5.5397 5.4786 2.7250 3.0254 5.5217 7.1284 5.4908 6.5562 6.6164 12.6303 1.0911 1.0916 1.0867 1.0888 1.0888 1.0927 1.0952 1.1004 1.0971
irintensity: 0.4491 1.7620 2.6549 2.2724 2.5522 0.0241 0.0288 0.0748 0.0759 0.1235 0.0031 26.4186 0.3549 4.2588 1.0777 0.5684 4.0600 2.0602 8.0810 0.7062 0.5171 0.1522 60.9507 9.8330 0.2866 0.0194 8.9963 0.2708 19.1637 0.8164 65.1467 16.3807 3.9810 14.6397 3.8740 0.0026 4.2436 0.9592 9.7146 8.6155 0.7291 6.2284 1.5637 7.9223 0.2498 0.7045 1.8696 1.5903 4.5452 8.2796 2.0159 5.5291 1.5474 2.0063 6.7627 1.3932 0.1352 9.0535 4.0965 74.2424 9.5153 0.0621 6.8537 0.1576 6.4061 1.8615 31.8368 41.8232 8.2217
temp: 298.150 k
press: 1.00000 atm
elementType: 7 6 6 6 6 6 6 6 6 6 6 6 6 6 6 6 1 1 1 1 1 1 1 1 1
symmnumber: 1
zpe: 497321.4 jmol-1
zpe.correction: 0.189420 hartree
zpe.thermalcorrener: 0.200871 hartree
zpe.thermalcorrenthalpy: 0.201815 hartree
zpe.thermalcorrgfe: 0.151845 hartree
zpe.sumelectzpe: -630.704865 hartree
zpe.sumelectthermal: -630.693414 hartree
zpe.sumelectthermalent: -630.692470 hartree
zpe.sumelectthermalfe: -630.742440 hartree
dipole: 5.5457 1.4752 0.0001
dipole: 5.7385
quadrupole: -111.5161 -78.4006 -97.9833
quadrupole: -9.6784 -0.0003 0.0006
quadrupole: -15.5494 17.5661 -2.0166 -9.6784 -0.0003 0.0006
hfenergy: -630.894285 hartree
pointgroup: C01 [X(C15H9N1)]
dipole: -2.1852923 -0.5672194 0.0000356 debye
dipolederiv: -0.6330579 -0.0342389 0.0000072 -0.1515286 -0.2371931 0.0000021 0.0000056 0. -0.2490085 -0.107762 -0.0354254 0.0000024 -0.1499505 -0.0995663 0.0000061 0.0000052 0.0000042 0.0316352 0.1820409 -0.1050444 0.0000021 0.146848 -0.1055989 0.0000028 -0.0000052 0.0000067 0.0336732 0.0803149 -0.0865621 0.0000018 -0.0883167 -0.1198096 0.0000065 0.000002 0.0000059 0.038295 0.1965505 -0.0390614 -0.0000006 0.0028117 -0.1011062 0.0000048 -0.000002 0.0000054 0.0468016 -0.0105477 0.05726 -0.0000035 -0.025579 0.1378625 -0.0000099 -0.0000011 -0.0000095 -0.1729662 -0.2038438 0.0818342 -0.000003 0.0438995 0.158794 -0.0000128 0.0000002 -0.0000155 -0.1809612 0.3008127 0.0263175 -0.0000045 -0.0084651 0.0353197 -0.0000062 -0.0000032 -0.0000042 -0.1468319 -0.0730659 0.0777126 -0.0000038 -0.1141232 0.1346906 -0.0000083 0.0000011 -0.000012 -0.1480312 -0.0634438 0.0494344 -0.000003 -0.1034424 0.1196542 -0.0000078 0.0000017 -0.0000092 -0.1652342 -0.1110604 0.0419714 -0.0000024 0.1523642 0.1019422 -0.0000093 -0.0000061 -0.0000066 -0.1697332 -0.3295061 0.043403 0.000002 0.0329616 0.2063111 -0.0000033 0.0000007 -0.0000036 0.1102482 -0.0782907 -0.1517113 0.0000057 0.1045332 0.0579072 -0.0000087 0.0000012 -0.0000067 -0.1683445 -0.0328976 -0.1483279 0.000003 -0.1030454 0.0610723 -0.0000056 0.0000021 -0.0000051 -0.1567254 0.0351207 0.1342641 -0.0000066 0.0760056 0.042607 -0.0000071 -0.0000034 -0.0000083 -0.1525911 0.6693945 0.1069202 -0.0000105 0.2267743 -0.0327745 -0.0000008 -0.0000102 0.0000007 0.0218594 0.0570712 -0.0202229 0.0000016 -0.0181337 -0.0748604 0.0000074 0.0000013 0.0000067 0.1527935 0.0525677 -0.01918 0.0000019 -0.0261079 -0.0831692 0.0000085 0.0000022 0.0000096 0.1530153 0.0730262 0.0121293 0.0000004 -0.0563573 -0.043877 0.0000069 0.0000026 0.0000053 0.1601395 0.0616874 -0.0653832 0.000003 0.0116267 -0.0823796 0.0000079 0.0000002 0.0000096 0.1558684 0.0731504 -0.066226 0.0000033 0.0293703 -0.0916281 0.0000074 0.0000007 0.0000083 0.157315 0.0675578 0.0202911 0.0000004 -0.0786761 -0.0950456 0.0000082 0.0000031 0.0000062 0.1573723 -0.0175831 0.0879432 -0.0000019 0.0589128 0.0402861 0.000004 -0.0000031 0.0000043 0.1675256 -0.0688497 0.1062245 -0.0000006 0.1145547 0.0090528 0.0000033 -0.0000013 0.0000038 0.1622668 -0.1193863 -0.0743221 0.0000055 -0.0769367 0.0615088 0.000004 0.0000056 0.0000039 0.1616183 unknown
polarizability: 353.5497609|-3.5174226|161.8730727|-0.0026982|-0.003038|62.0247305 unknown
InChI: InChI=1S/C15H9N/c16-10-11-5-6-14-8-12-3-1-2-4-13(12)9-15(14)7-11/h1-9H
charge 0 multiplicity 1
25 atoms
N  5.520576 1.037883 -0.000059
C  0.621605 0.433377 -0.000016
C  0.418742 -1.014319 0.00003
C  -1.826742 0.778526 -0.000002
C  -2.029343 -0.669341 0.000048
C  -0.506685 1.291259 -0.000032
C  -0.899867 -1.525962 0.000062
C  1.962157 0.948104 -0.000047
C  1.577443 -1.873222 0.000048
C  -2.982244 1.640675 -0.000011
C  -3.376776 -1.179986 0.000083
C  3.063134 0.083124 -0.000025
C  2.861922 -1.351315 0.00002
C  -4.267901 1.109754 0.000023
C  -4.467185 -0.315872 0.000069
C  4.402824 0.608854 -0.000049
H  -0.353989 2.37792 -0.000067
H  -1.05256 -2.612608 0.000104
H  2.120066 2.032218 -0.000082
H  1.427371 -2.959027 0.000088
H  -2.829107 2.72643 -0.000046
H  -3.52828 -2.265965 0.000116
H  3.737444 -2.007551 0.000039
H  -5.138789 1.774144 0.000013
H  -5.487116 -0.715497 0.000093
