program: Gaussian 09
title: 000003274
version: EM64L-G09RevD.01
frameworkgroup: C1[X(C22H26O5)]
method: RPBEPBE
basis: SDD
operation: Freq
keyword: #pfreq=noraman
keyword: PBEPBE/SDD
title: #p freq=noraman PBEPBE/SDD
converged: NO YES NO NO
title: Mulliken charges:
elementType: O O O O O C C C C C C C C C C C C C C C C C C C C C C H H H H H H H H H H H H H H H H H H H H H H H H H H
charge: -0.185970 -0.282473 -0.231716 -0.412712 -0.238051 -0.207359 0.263458 -0.061431 -0.171245 -0.495444 -0.517489 -0.469695 -0.499902 0.067500 -0.513149 -0.786598 0.263518 -0.579760 0.290324 -0.349622 -0.501282 -0.465044 0.344342 0.230218 -0.513752 -0.475427 0.193737 0.219942 0.227846 0.212040 0.211328 0.231988 0.218559 0.235509 0.222988 0.201169 0.212093 0.221052 0.249092 0.243208 0.215970 0.247164 0.217300 0.226415 0.232125 0.226243 0.304064 0.257688 0.281159 0.262355 0.285931 0.262201 0.379591
chargesum: 0.00000
title: Mulliken charges with hydrogens summed into heavy atoms:
elementType: O O O O O C C C C C C C C C C C C C C C C C C C C C C
charge: -0.185970 -0.282473 -0.231716 -0.033121 -0.238051 0.012584 0.263458 0.166415 0.040795 -0.052128 -0.063421 -0.045537 -0.066757 0.067500 -0.020848 -0.106164 0.263518 -0.121220 0.290324 -0.123379 -0.197218 -0.207356 0.344342 0.230218 0.029762 0.072705 0.193737
polarizability: 3.67496626e+02 3.00908143e+00 2.23128024e+02 3.12603941e+00 3.88713281e+00 1.65930775e+02
1716.lowfreq: -26.2693 -6.6701 -2.5520 -0.0011 0.0006 0.0013 12.0424 17.4447 29.9900
frequency: -3.9094 16.2282 29.8909 34.8482 39.3923 57.2682 70.2296 76.8192 93.2988 117.2197 124.1138 132.0934 150.9712 172.4225 175.0504 201.5600 216.5053 235.0241 251.7553 254.2308 263.0643 293.5021 310.3005 331.7719 362.0539 388.0863 407.1111 421.5264 432.1937 446.0296 466.0135 481.5610 504.4174 517.9166 525.9186 531.3412 553.5913 562.6082 575.2226 584.3578 608.4871 616.5006 646.3413 654.1883 692.8014 693.9388 712.0574 731.4944 784.1922 792.1860 795.0202 812.9101 832.6028 839.3753 849.9119 854.0649 877.4332 892.5342 917.6332 922.1501 929.4967 953.2884 959.4319 968.7753 997.8689 1008.4569 1017.7870 1018.2949 1024.7221 1032.6738 1050.2151 1057.7478 1066.9542 1085.3945 1093.4809 1095.2254 1107.5149 1121.0092 1132.0299 1134.1939 1144.2482 1154.3346 1164.3995 1174.2399 1184.9228 1202.2808 1205.4751 1218.0768 1228.7398 1241.2763 1241.7332 1254.1887 1257.3437 1258.9154 1260.8048 1278.8459 1284.7915 1287.6144 1296.3465 1320.6332 1324.3616 1324.7515 1333.6111 1336.0543 1340.2347 1353.4584 1367.7180 1376.2088 1381.8387 1382.2926 1412.9706 1431.3496 1443.0882 1451.9602 1454.7521 1456.7700 1464.5374 1470.0838 1470.6014 1478.1769 1483.3378 1488.1027 1588.1139 1606.8653 1640.2362 1650.2402 1665.1419 2914.1455 2932.9065 2948.0124 2960.6023 2966.5593 2971.9824 2978.4249 2985.3305 2988.9365 2999.5629 3005.4097 3005.8118 3021.4333 3033.8050 3038.1669 3045.9461 3061.0305 3064.9579 3071.8003 3073.8408 3081.4437 3084.3802 3142.9900 3170.5437 3187.1846 3515.1564
redmass: 6.3040 7.6156 6.2131 8.1508 5.2815 4.1116 4.4598 3.6997 3.3345 3.1256 5.1862 3.4290 1.1448 3.4090 2.5333 3.9945 2.7142 3.2486 4.7631 2.4904 3.8940 4.3798 5.1355 3.2480 2.6946 3.9429 3.6212 3.7371 3.9750 3.1202 3.0828 3.1940 2.5686 2.3638 2.6556 2.8489 3.3344 3.7181 3.2538 4.1410 4.2792 3.7640 1.5347 3.6194 4.2923 3.1208 5.5715 3.7041 2.0932 1.8197 2.0306 2.0433 1.5750 2.4945 3.6263 1.9558 2.3252 3.4613 2.4128 1.5012 3.7597 1.5903 1.4183 2.0264 2.1145 1.9622 2.1446 2.1713 2.0658 2.1733 2.9733 1.8173 2.3758 2.3275 2.4928 2.0171 2.1210 2.7050 1.9947 1.7874 1.7278 1.8271 1.2617 1.6498 1.8610 1.5364 2.4076 1.6564 2.3603 1.3373 1.8863 1.4782 1.3541 1.4006 1.4640 1.3443 1.4144 1.2457 1.2838 1.5705 1.4516 1.6575 1.4413 1.4890 1.4243 1.5786 1.6186 4.6425 1.2477 1.9478 3.8022 1.0807 1.0753 1.0955 1.1335 1.0805 1.0842 1.0601 1.0880 1.0662 1.0871 2.4112 7.8403 6.6425 10.1107 11.8411 8.1649 1.0793 1.0826 1.0842 1.0647 1.0647 1.0613 1.0368 1.0598 1.0649 1.0653 1.0629 1.0645 1.0947 1.1024 1.0953 1.1024 1.0962 1.0937 1.0993 1.1015 1.0995 1.0967 1.0873 1.0961 1.0923 1.0639
irintensity: 0.2005 0.3337 0.9900 1.1974 0.7370 0.2643 6.1691 1.1346 1.2400 0.6480 3.7513 1.5596 0.2564 0.5571 0.5500 2.9429 2.8977 0.0078 2.0095 0.5487 3.8795 2.8156 6.2447 4.5505 0.6124 0.3902 0.0380 12.5397 5.7992 9.8964 5.0237 14.1784 44.4000 7.6871 4.8711 4.5597 5.7610 29.1644 3.0032 21.0332 2.3996 4.7389 107.7733 16.8041 4.1362 1.7585 0.9998 0.8185 7.4863 7.3231 19.2889 11.9737 27.7903 1.8854 13.4567 7.5818 4.1593 26.3365 3.0953 24.1514 46.7573 6.7189 3.4256 17.4903 16.8679 3.8721 5.3037 59.4138 1.0279 15.1645 125.5287 1.0849 39.7713 34.8500 138.2388 34.3941 3.2148 446.6177 97.1683 23.1177 56.4482 65.1858 26.2045 5.3029 9.0581 5.7632 33.6199 5.0852 65.0036 39.1697 18.7048 13.1038 7.8914 0.6820 10.6590 8.7664 0.8302 4.4579 4.6996 3.5399 45.6298 155.0098 1.1940 2.9473 0.9447 1.8963 3.4561 7.7300 26.7728 6.0251 10.1566 20.0430 5.5714 73.6662 11.8646 3.9394 11.9492 2.6486 7.9394 4.6176 11.8839 135.0681 5.8263 18.0658 211.8838 183.1311 185.0356 4.8646 20.6148 37.5878 21.7473 25.2248 45.2563 21.6497 35.2666 14.2759 2.0057 24.1337 33.3084 30.7611 44.2259 31.0276 49.7403 14.6843 2.7100 22.2226 38.5280 19.1081 7.3122 13.8049 7.2571 2.4038 27.9210
temp: 298.150 k
press: 1.00000 atm
elementType: 8 8 8 8 8 6 6 6 6 6 6 6 6 6 6 6 6 6 6 6 6 6 6 6 6 6 6 1 1 1 1 1 1 1 1 1 1 1 1 1 1 1 1 1 1 1 1 1 1 1 1 1 1
symmnumber: 1
zpe: 1141682.0 jmol-1
zpe.correction: 0.434844 hartree
zpe.thermalcorrener: 0.459270 hartree
zpe.thermalcorrenthalpy: 0.460214 hartree
zpe.thermalcorrgfe: 0.379105 hartree
zpe.sumelectzpe: -1228.089952 hartree
zpe.sumelectthermal: -1228.065526 hartree
zpe.sumelectthermalent: -1228.064582 hartree
zpe.sumelectthermalfe: -1228.145691 hartree
dipole: 1.6641 1.5701 -1.4381
dipole: 2.7023
quadrupole: -181.9711 -159.0317 -158.0609
quadrupole: -9.7791 -3.4822 4.5174
quadrupole: -15.6165 7.3228 8.2937 -9.7791 -3.4822 4.5174
hfenergy: -1228.5247959 hartree
pointgroup: C01 [X(C22H26O5)]
dipole: -0.6527203 0.8239758 0.1592931 debye
polarizability: 367.3056772|-1.4657393|204.7226025|6.9710728|-27.0575299|184.5271447 unknown
InChI: InChI=1S/C22H26O5/c1-22-11-10-16-15-5-3-14(27-21(26)9-8-20(24)25)12-13(15)2-4-17(16)18(22)6-7-19(22)23/h3,5,12,16-18,24H,2,4,6-11H2,1H3
charge 0 multiplicity 1
53 atoms
O  7.544918 -0.792342 0.38642
O  -3.546829 -0.536035 0.575565
O  -4.271592 0.968879 -1.086505
O  -9.391331 0.820365 -0.356941
O  -8.560482 -1.346744 -0.393842
C  4.37258 0.604861 -0.726815
C  5.143402 -0.672873 -0.259475
C  2.836242 0.423895 -0.791599
C  2.244615 -0.144297 0.525787
C  4.473581 -1.278048 1.025077
C  4.899983 1.741894 0.204055
C  2.950354 -1.483725 0.870548
C  2.095134 1.719605 -1.188654
C  6.510072 -0.10872 0.195308
C  6.401404 1.413323 0.3865
C  5.314848 -1.753449 -1.346724
C  0.710969 -0.235654 0.467416
C  0.624432 1.403704 -1.523834
C  -0.046628 0.515754 -0.477594
C  0.003923 -1.039013 1.401842
C  -1.464448 0.4488 -0.479621
C  -1.399411 -1.114594 1.407816
C  -2.127223 -0.365666 0.459589
C  -4.512843 0.118202 -0.202276
C  -5.888665 -0.396879 0.186113
C  -7.002448 0.572991 -0.242439
C  -8.348912 -0.115286 -0.329032
H  4.717927 0.842378 -1.757348
H  2.631979 -0.327533 -1.587696
H  2.49255 0.570082 1.344154
H  4.647143 -0.61116 1.894909
H  4.977151 -2.23443 1.259706
H  4.382004 1.725372 1.181065
H  4.738665 2.741753 -0.23327
H  2.728376 -2.228325 0.080712
H  2.564323 -1.904135 1.817659
H  2.584637 2.193582 -2.062268
H  2.144177 2.447571 -0.354082
H  6.837402 1.723599 1.352223
H  7.015971 1.888909 -0.404637
H  5.667741 -1.309862 -2.296282
H  6.064923 -2.496421 -1.021512
H  4.365826 -2.280755 -1.550466
H  0.581171 0.889222 -2.506702
H  0.042074 2.337248 -1.64261
H  0.55596 -1.619221 2.148069
H  -2.036634 1.03341 -1.202331
H  -1.938504 -1.736216 2.128428
H  -6.043501 -1.377078 -0.307255
H  -5.910408 -0.600677 1.269823
H  -6.76574 0.993236 -1.240002
H  -7.082841 1.439965 0.435632
H  -10.259622 0.342039 -0.452704
