program: Orca
programVersion: 4.2.1
elementType: Cl Cl O N N C C C C C C C C C C C C C C H H H H H H H H H H H H
charge: 0
multiplicity: 1
keywords: wb97x-d3
keywords: def2-TZVPP
keywords: def2/J RIJCOSX GRIDX6 NOFINALGRIDX
keywords: grid4 nofinalgrid
keywords: scfconv7
keywords: smallprint printgap noloewdin
keywords: NOSOSCF
formula: C14H12Cl2N2O
InChI: InChI=1S/C14H12Cl2N2O/c1-19-18-14(7-10-3-2-6-17-9-10)12-5-4-11(15)8-13(12)16/h2-6,8-9H,7H2,1H3
31 atoms
Cl -0.240652 -1.148809 2.853513
Cl -4.50352 -1.998165 -0.272754
O  3.358451 -0.63889 -0.207813
N  2.091372 -1.131036 -0.265313
N  0.030607 3.5260 -1.402363
C  1.511366 0.965813 0.922005
C  1.235433 -0.378501 0.293575
C  -0.173207 -0.817374 0.170716
C  1.422564 2.036487 -0.134264
C  -0.949238 -1.148765 1.277341
C  -0.774319 -0.880261 -1.082331
C  2.536204 2.474464 -0.839863
C  0.19557 2.606186 -0.465324
C  -2.279131 -1.514605 1.15446
C  -2.101371 -1.242307 -1.23449
C  -2.846138 -1.552282 -0.108734
C  2.377022 3.442792 -1.816779
C  1.103629 3.933297 -2.063157
C  4.252006 -1.55563 -0.799661
H  0.774499 1.159188 1.701576
H  2.49151 0.975966 1.397973
H  -0.185558 -0.627402 -1.953443
H  3.513422 2.063228 -0.623779
H  -0.701839 2.297984 0.063924
H  -2.859041 -1.774415 2.028383
H  -2.552182 -1.27771 -2.215918
H  3.223457 3.812375 -2.379436
H  0.942871 4.690494 -2.822734
H  4.261141 -2.511696 -0.271845
H  5.239611 -1.103004 -0.732104
H  4.011763 -1.73422 -1.849985
totalener: -1645.84660701 hartree
nucrepener: 1602.58450625 hartree
electener: -3248.43111326 hartree
oneelecener: -5440.50350872 hartree
twoeener: 2192.07239546 hartree
kineticenergy: 1641.47768133 hartree
xcener: -112.970551364826 hartree
chargesum: 0.0000000
charge: -0.062955 -0.066040 -0.212187 -0.099359 -0.284236 -0.083472 0.102982 0.020102 0.029623 0.046004 -0.141880 -0.126394 -0.056489 -0.164468 -0.137393 0.106103 -0.118317 0.006153 -0.112679 0.112867 0.099140 0.127385 0.119214 0.107325 0.117294 0.125752 0.123454 0.118313 0.105199 0.099371 0.099585
qa: -0.0630 -0.0660 -0.2122 -0.0994 -0.2842 -0.0835 0.1030 0.0201 0.0296 0.0460 -0.1419 -0.1264 -0.0565 -0.1645 -0.1374 0.1061 -0.1183 0.0062 -0.1127 0.1129 0.0991 0.1274 0.1192 0.1073 0.1173 0.1258 0.1235 0.1183 0.1052 0.0994 0.0996
va: 1.2630 1.2387 1.9717 2.9200 3.1006 3.8398 3.8591 3.6401 3.5671 3.9199 3.9753 3.9919 4.0965 4.0835 4.0251 3.9293 3.9048 4.0217 3.9091 1.0202 1.0350 1.0151 1.0222 1.0081 1.0243 1.0109 1.0012 1.0007 0.9972 0.9955 0.9970
dispcorr: -0.015447693 hartree
energy: -1645.862054705551
dipole: 23.47328 -22.29361 1.17967 9.99607 -10.11543 -0.11936 -10.66956 10.44331 -0.22625
magnitude: 1.20709 au
magnitude: 3.06817 debye
