program: Orca
programVersion: 4.2.1
elementType: Cl Cl O N N C C C C C C C C C C C C C C H H H H H H H H H H H H
charge: 0
multiplicity: 1
keywords: wb97x-d3
keywords: def2-TZVPP
keywords: def2/J RIJCOSX GRIDX6 NOFINALGRIDX
keywords: grid4 nofinalgrid
keywords: scfconv7
keywords: smallprint printgap noloewdin
keywords: NOSOSCF
formula: C14H12Cl2N2O
InChI: InChI=1S/C14H12Cl2N2O/c1-19-18-14(7-10-3-2-6-17-9-10)12-5-4-11(15)8-13(12)16/h2-6,8-9H,7H2,1H3
31 atoms
Cl 0.15279 -1.257841 2.902422
Cl -4.562306 -1.667126 0.397106
O  3.33301 -1.043917 -0.587116
N  2.029673 -1.411164 -0.462096
N  2.009034 3.095322 -2.24225
C  1.779088 0.766673 0.705693
C  1.322326 -0.566081 0.167181
C  -0.124412 -0.876685 0.240273
C  1.419136 1.846591 -0.280859
C  -0.764828 -1.164587 1.441173
C  -0.897902 -0.853418 -0.915747
C  0.204854 2.517312 -0.21851
C  2.27921 2.181765 -1.32415
C  -2.126585 -1.411157 1.502787
C  -2.26008 -1.095696 -0.883986
C  -2.864962 -1.368986 0.331771
C  -0.089338 3.47561 -1.174572
C  0.846771 3.727196 -2.165389
C  4.057154 -2.072987 -1.225322
H  1.283892 0.961277 1.657869
H  2.851272 0.760952 0.896014
H  -0.415913 -0.631209 -1.858076
H  -0.502141 2.293638 0.5717
H  3.234988 1.675437 -1.414688
H  -2.599687 -1.641833 2.446471
H  -2.844481 -1.069635 -1.792612
H  -1.023812 4.019426 -1.151872
H  0.651965 4.471683 -2.929511
H  3.675053 -2.274589 -2.228324
H  4.039187 -2.99937 -0.647133
H  5.083819 -1.719535 -1.299335
totalener: -1645.84632407 hartree
nucrepener: 1606.88695293 hartree
electener: -3252.73327700 hartree
oneelecener: -5448.98682524 hartree
twoeener: 2196.25354824 hartree
kineticenergy: 1641.47719319 hartree
xcener: -112.970322225609 hartree
chargesum: 0.0000000
charge: -0.061762 -0.066661 -0.210437 -0.093920 -0.286404 -0.088067 0.092785 0.013763 0.037596 0.057555 -0.141823 -0.183775 -0.012974 -0.171028 -0.145358 0.110014 -0.107524 0.003424 -0.113893 0.111502 0.104410 0.128600 0.121915 0.107056 0.118547 0.126401 0.125122 0.118835 0.099820 0.103155 0.103126
qa: -0.0618 -0.0667 -0.2104 -0.0939 -0.2864 -0.0881 0.0928 0.0138 0.0376 0.0576 -0.1418 -0.1838 -0.0130 -0.1710 -0.1454 0.1100 -0.1075 0.0034 -0.1139 0.1115 0.1044 0.1286 0.1219 0.1071 0.1185 0.1264 0.1251 0.1188 0.0998 0.1032 0.1031
va: 1.2640 1.2380 1.9714 2.9244 3.1033 3.8332 3.8634 3.6695 3.5598 3.9037 3.9677 3.9997 4.0797 4.0908 4.0234 3.9223 3.8980 4.0286 3.9084 1.0202 1.0391 1.0125 1.0068 1.0234 1.0241 1.0108 1.0004 1.0008 0.9972 0.9966 0.9959
dispcorr: -0.015596437 hartree
energy: -1645.861920510066
dipole: 18.57899 -18.73241 -0.15341 8.44915 -8.45221 -0.00306 -12.19623 12.36573 0.16950
magnitude: 0.22864 au
magnitude: 0.58116 debye
