program: Orca
programVersion: 4.2.1
elementType: Cl Cl O N N C C C C C C C C C C C C C C H H H H H H H H H H H H
charge: 0
multiplicity: 1
keywords: wb97x-d3
keywords: def2-TZVPP
keywords: def2/J RIJCOSX GRIDX6 NOFINALGRIDX
keywords: grid4 nofinalgrid
keywords: scfconv7
keywords: smallprint printgap noloewdin
keywords: NOSOSCF
formula: C14H12Cl2N2O
InChI: InChI=1S/C14H12Cl2N2O/c1-19-18-14(7-10-3-2-6-17-9-10)12-5-4-11(15)8-13(12)16/h2-6,8-9H,7H2,1H3
31 atoms
Cl 0.128639 0.138868 2.561173
Cl -4.362877 -1.268457 0.023762
O  3.584169 -1.751047 -0.174886
N  2.235542 -1.898937 -0.112637
N  0.091512 2.64793 -2.12428
C  2.265749 0.560968 0.117978
C  1.613543 -0.801027 0.042487
C  0.137431 -0.929653 0.072791
C  1.368987 1.677111 -0.336819
C  -0.633769 -0.493681 1.145177
C  -0.529737 -1.505504 -1.004141
C  1.002927 2.726557 0.492691
C  0.879948 1.704008 -1.641497
C  -2.014972 -0.592165 1.14201
C  -1.90761 -1.619581 -1.033876
C  -2.642894 -1.151028 0.042165
C  0.177619 3.725419 0.000542
C  -0.254929 3.637444 -1.312358
C  4.193508 -3.008358 -0.367999
H  2.610012 0.742823 1.139095
H  3.169722 0.543011 -0.495548
H  0.05185 -1.863528 -1.842734
H  1.357129 2.76277 1.515227
H  1.148227 0.909467 -2.333356
H  -2.589546 -0.248023 1.989841
H  -2.404096 -2.06115 -1.886074
H  -0.126303 4.555561 0.623527
H  -0.90443 4.398353 -1.730504
H  5.265048 -2.82251 -0.409101
H  3.87559 -3.474576 -1.303445
H  3.980244 -3.691598 0.456895
totalener: -1645.84508527 hartree
nucrepener: 1636.93735814 hartree
electener: -3282.78244341 hartree
oneelecener: -5509.37010309 hartree
twoeener: 2226.58765968 hartree
kineticenergy: 1641.47821030 hartree
xcener: -112.973157845446 hartree
chargesum: 0.0000000
charge: -0.072973 -0.068080 -0.209965 -0.103019 -0.282782 -0.130121 0.083265 0.065789 0.031138 0.061587 -0.152008 -0.141286 -0.028939 -0.157145 -0.137920 0.106384 -0.112334 0.005483 -0.110240 0.111992 0.121275 0.121395 0.114878 0.103907 0.114034 0.123842 0.123362 0.117884 0.103990 0.095620 0.100988
qa: -0.0730 -0.0681 -0.2100 -0.1030 -0.2828 -0.1301 0.0833 0.0658 0.0311 0.0616 -0.1520 -0.1413 -0.0289 -0.1571 -0.1379 0.1064 -0.1123 0.0055 -0.1102 0.1120 0.1213 0.1214 0.1149 0.1039 0.1140 0.1238 0.1234 0.1179 0.1040 0.0956 0.1010
va: 1.2561 1.2373 1.9761 2.9075 3.1011 3.8175 3.8162 3.6246 3.5374 3.9044 4.0049 3.9769 4.0798 4.0917 4.0399 3.9358 3.9158 4.0299 3.9163 1.0092 1.0223 1.0202 1.0197 1.0087 1.0251 1.0116 1.0007 1.0009 0.9952 0.9959 0.9963
dispcorr: -0.016150702 hartree
energy: -1645.861235976000
dipole: 20.24907 -19.49579 0.75328 1.56960 -1.64911 -0.07951 -8.12214 8.46397 0.34183
magnitude: 0.83102 au
magnitude: 2.11229 debye
