program: Orca
programVersion: 4.2.1
elementType: Cl Cl O N N C C C C C C C C C C C C C C H H H H H H H H H H H H
charge: 0
multiplicity: 1
keywords: wb97x-d3
keywords: def2-TZVPP
keywords: def2/J RIJCOSX GRIDX6 NOFINALGRIDX
keywords: grid4 nofinalgrid
keywords: scfconv7
keywords: smallprint printgap noloewdin
keywords: NOSOSCF
formula: C14H12Cl2N2O
InChI: InChI=1S/C14H12Cl2N2O/c1-19-18-14(7-10-3-2-6-17-9-10)12-5-4-11(15)8-13(12)16/h2-6,8-9H,7H2,1H3
31 atoms
Cl -0.23919 0.057017 -1.964355
Cl -4.487901 -1.741606 0.736872
O  3.421032 -1.065539 -0.197484
N  2.102196 -1.395263 -0.177713
N  1.976348 3.351968 -1.214652
C  1.863761 0.579254 1.315512
C  1.39622 -0.627344 0.542271
C  -0.059188 -0.91067 0.559867
C  1.471244 1.820482 0.55937
C  -0.885148 -0.635096 -0.526878
C  -0.647045 -1.433891 1.706934
C  0.26895 2.473835 0.786488
C  2.282471 2.309757 -0.461245
C  -2.248331 -0.887782 -0.478397
C  -2.002684 -1.698972 1.778337
C  -2.794277 -1.422446 0.675183
C  -0.065739 3.563405 -0.000704
C  0.820931 3.960601 -0.988738
C  4.118886 -1.957374 -1.038954
H  1.386837 0.579042 2.298567
H  2.940209 0.549272 1.475829
H  -0.021012 -1.65314 2.56286
H  -0.402016 2.132592 1.566057
H  3.227344 1.82003 -0.676028
H  -2.873162 -0.667762 -1.332033
H  -2.437215 -2.118461 2.674403
H  -0.996075 4.094598 0.146029
H  0.591508 4.808399 -1.624748
H  5.159445 -1.639204 -1.02099
H  3.749677 -1.915431 -2.06568
H  4.053496 -2.987408 -0.681457
totalener: -1645.84332269 hartree
nucrepener: 1641.29565002 hartree
electener: -3287.13897271 hartree
oneelecener: -5518.14017023 hartree
twoeener: 2231.00119752 hartree
kineticenergy: 1641.48964716 hartree
xcener: -112.973594977076 hartree
chargesum: 0.0000000
charge: -0.044857 -0.067319 -0.210698 -0.077584 -0.277665 -0.083493 0.074896 0.036318 0.042482 0.015311 -0.123923 -0.188409 -0.020813 -0.151394 -0.167185 0.100895 -0.093311 -0.001151 -0.114434 0.103014 0.109302 0.127163 0.119536 0.104713 0.116706 0.124667 0.122785 0.117363 0.102760 0.103417 0.100908
qa: -0.0449 -0.0673 -0.2107 -0.0776 -0.2777 -0.0835 0.0749 0.0363 0.0425 0.0153 -0.1239 -0.1884 -0.0208 -0.1514 -0.1672 0.1009 -0.0933 -0.0012 -0.1144 0.1030 0.1093 0.1272 0.1195 0.1047 0.1167 0.1247 0.1228 0.1174 0.1028 0.1034 0.1009
va: 1.2729 1.2377 1.9679 2.9104 3.1002 3.8261 3.8737 3.6528 3.5486 3.9903 3.9419 4.0096 4.0868 4.0735 4.0558 3.9283 3.8986 4.0354 3.9091 1.0104 1.0371 1.0072 1.0077 1.0233 1.0251 1.0127 0.9999 1.0011 0.9957 0.9973 0.9969
dispcorr: -0.016636918 hartree
energy: -1645.859959607507
dipole: 19.87741 -19.89294 -0.01553 4.62652 -4.92909 -0.30257 5.03500 -4.02098 1.01402
magnitude: 1.05832 au
magnitude: 2.69002 debye
