program: Orca
programVersion: 4.2.1
elementType: Cl Cl Cl Cl Cl Cl O O N N N N C C C C C C C C C C H H H H H H H H H H H H H H
charge: 0
multiplicity: 1
keywords: wb97x-d3
keywords: def2-TZVPP
keywords: def2/J RIJCOSX GRIDX6 NOFINALGRIDX
keywords: grid4 nofinalgrid
keywords: scfconv7
keywords: smallprint printgap noloewdin
keywords: NOSOSCF
formula: C10H14Cl6N4O2
InChI: InChI=1S/C10H14Cl6N4O2/c11-9(12,13)7(17-5-21)19-1-2-20(4-3-19)8(18-6-22)10(14,15)16/h5-8,17-18H,1-4H2
36 atoms
Cl 4.1626 -1.159442 -1.28236
Cl 3.42804 1.612005 -1.56401
Cl 5.352157 0.807467 0.419198
Cl -4.161923 1.150854 1.287549
Cl -5.349178 -0.817505 -0.413929
Cl -3.417353 -1.618517 1.563802
O  3.218634 0.31533 3.478418
O  -3.218203 -0.312745 -3.478438
N  1.40374 0.23163 0.139526
N  -1.402404 -0.229285 -0.142351
N  3.057702 -0.87787 1.544368
N  -3.063169 0.877023 -1.541859
C  -0.897792 0.997541 0.450776
C  0.444508 0.743409 1.106438
C  -0.443673 -0.740419 -1.109795
C  0.898624 -0.994778 -0.454504
C  2.733293 0.219679 0.667381
C  -2.732879 -0.220819 -0.66726
C  3.846574 0.356465 -0.407224
C  -3.843098 -0.362829 0.4098
C  3.251192 -0.735381 2.870303
C  -3.25594 0.736482 -2.868215
H  -1.571116 1.357408 1.225724
H  -0.784224 1.800872 -0.292375
H  -0.80805 -1.685793 -1.514967
H  -0.303694 -0.050166 -1.955334
H  0.304283 0.053638 1.952251
H  0.808507 1.689163 1.511389
H  1.571851 -1.353756 -1.229915
H  0.7853 -1.798819 0.28792
H  2.836791 1.129935 1.260708
H  -2.834566 -1.130526 -1.261863
H  3.083797 -1.816716 1.175209
H  -3.091657 1.815152 -1.171272
H  3.449687 -1.699461 3.358468
H  -3.454802 1.701298 -3.354937
elementType: Cl O N C H
totalener: -3520.31258509 hartree
nucrepener: 2981.79061561 hartree
electener: -6502.10320070 hartree
twoeener: 4284.37529493 hartree
cpcmener: -0.03708781 hartree
kineticenergy: 3513.11027657 hartree
xcener: -198.304945654575 hartree
chargesum: 0.0000000
charge: -0.061851 -0.037106 -0.051352 -0.062010 -0.051427 -0.036864 -0.487294 -0.487144 -0.140912 -0.139612 -0.223881 -0.224632 -0.106625 -0.104186 -0.104806 -0.105923 0.012556 0.011689 0.130560 0.130975 0.267398 0.267721 0.105589 0.084826 0.096627 0.084820 0.084964 0.095068 0.105101 0.085263 0.127680 0.128131 0.184926 0.184391 0.118623 0.118718
qa: -0.0619 -0.0371 -0.0514 -0.0620 -0.0514 -0.0369 -0.4873 -0.4871 -0.1409 -0.1396 -0.2239 -0.2246 -0.1066 -0.1042 -0.1048 -0.1059 0.0126 0.0117 0.1306 0.1310 0.2674 0.2677 0.1056 0.0848 0.0966 0.0848 0.0850 0.0951 0.1051 0.0853 0.1277 0.1281 0.1849 0.1844 0.1186 0.1187
va: 1.2438 1.2708 1.2465 1.2438 1.2464 1.2710 2.0002 2.0003 2.8607 2.8601 3.0944 3.0938 3.9249 4.0184 4.0167 3.9244 4.0392 4.0391 4.5016 4.5012 4.1607 4.1600 1.0252 1.0239 1.0075 1.0180 1.0179 1.0079 1.0253 1.0238 1.0524 1.0519 1.0090 1.0097 0.9957 0.9957
dispcorr: -0.024535980 hartree
energy: -3520.337121068429
dipole: -0.03210 0.02621 -0.00588 0.05499 -0.06489 -0.00990 -0.02600 0.02593 -0.00007
magnitude: 0.01151 au
magnitude: 0.02927 debye
