program: Orca
programVersion: 4.2.1
elementType: Cl Cl Cl Cl Cl Cl O O N N N N C C C C C C C C C C H H H H H H H H H H H H H H
charge: 0
multiplicity: 1
keywords: wb97x-d3
keywords: def2-TZVPP
keywords: def2/J RIJCOSX GRIDX6 NOFINALGRIDX
keywords: grid4 nofinalgrid
keywords: scfconv7
keywords: smallprint printgap noloewdin
keywords: NOSOSCF
formula: C10H14Cl6N4O2
InChI: InChI=1S/C10H14Cl6N4O2/c11-9(12,13)7(17-5-21)19-1-2-20(4-3-19)8(18-6-22)10(14,15)16/h5-8,17-18H,1-4H2
36 atoms
Cl 3.261776 2.403227 1.25674
Cl 5.210554 0.339348 0.786514
Cl 3.836687 1.515978 -1.424228
Cl -2.838997 -1.157402 -2.216745
Cl -3.434731 -2.165221 0.415055
Cl -5.356369 -0.533681 -0.977405
O  3.20208 -2.807169 1.142186
O  -4.634301 2.808913 0.342864
N  1.222642 0.368815 0.448029
N  -1.587914 0.33299 0.062532
N  2.865224 -1.198829 -0.436701
N  -3.705359 0.875818 1.113496
C  -1.027563 0.069351 1.370664
C  0.356499 -0.52522 1.206477
C  -0.755274 1.266306 -0.666822
C  0.635562 0.689727 -0.844389
C  2.574362 -0.104556 0.456571
C  -2.999204 0.502231 -0.078521
C  3.646634 1.002147 0.267598
C  -3.629774 -0.786262 -0.682012
C  3.123061 -2.453012 -0.016719
C  -4.468996 1.982574 1.216068
H  -1.627504 -0.653229 1.922892
H  -0.964166 0.980437 1.983505
H  -1.176234 1.441503 -1.657134
H  -0.688917 2.241154 -0.160229
H  0.258271 -1.51092 0.727488
H  0.786526 -0.681231 2.197622
H  1.235558 1.437726 -1.357949
H  0.562509 -0.191774 -1.49829
H  2.76297 -0.473159 1.466513
H  -3.198709 1.281029 -0.818007
H  2.796471 -1.056263 -1.433304
H  -3.682172 0.263247 1.914705
H  3.262738 -3.143011 -0.860497
H  -4.936512 2.060791 2.20702
elementType: Cl O N C H
totalener: -3520.31227658 hartree
nucrepener: 2996.51720310 hartree
electener: -6516.82947968 hartree
twoeener: 4299.05317620 hartree
cpcmener: -0.03790710 hartree
kineticenergy: 3513.11580428 hartree
xcener: -198.307528960727 hartree
chargesum: -0.0000000
charge: -0.036368 -0.051884 -0.061689 -0.050421 -0.060600 -0.052313 -0.486344 -0.484585 -0.139392 -0.152242 -0.224870 -0.205931 -0.136617 -0.069858 -0.126200 -0.090498 0.018788 0.014522 0.125339 0.141640 0.266270 0.268173 0.103947 0.086711 0.099314 0.093767 0.076498 0.095480 0.099898 0.083870 0.128177 0.125412 0.184798 0.182559 0.118075 0.116570
qa: -0.0364 -0.0519 -0.0617 -0.0504 -0.0606 -0.0523 -0.4863 -0.4846 -0.1394 -0.1522 -0.2249 -0.2059 -0.1366 -0.0699 -0.1262 -0.0905 0.0188 0.0145 0.1253 0.1416 0.2663 0.2682 0.1039 0.0867 0.0993 0.0938 0.0765 0.0955 0.0999 0.0839 0.1282 0.1254 0.1848 0.1826 0.1181 0.1166
va: 1.2710 1.2453 1.2420 1.2555 1.2549 1.2604 2.0017 2.0081 2.8655 2.8214 3.0939 3.1203 3.9776 3.9594 3.9857 3.9139 4.0350 3.9967 4.5053 4.4695 4.1623 4.1616 1.0085 1.0206 1.0108 1.0162 1.0249 1.0085 1.0286 1.0267 1.0539 1.0481 1.0089 1.0075 0.9957 0.9957
dispcorr: -0.024681254 hartree
energy: -3520.336957832966
dipole: -4.66218 4.59714 -0.06504 0.84721 -1.23585 -0.38864 7.33161 -7.47996 -0.14835
magnitude: 0.42105 au
magnitude: 1.07022 debye
