program: Orca
programVersion: 4.2.1
elementType: Cl Cl Cl Cl Cl Cl O O N N N N C C C C C C C C C C H H H H H H H H H H H H H H
charge: 0
multiplicity: 1
keywords: wb97x-d3
keywords: def2-TZVPP
keywords: def2/J RIJCOSX GRIDX6 NOFINALGRIDX
keywords: grid4 nofinalgrid
keywords: scfconv7
keywords: smallprint printgap noloewdin
keywords: NOSOSCF
formula: C10H14Cl6N4O2
InChI: InChI=1S/C10H14Cl6N4O2/c11-9(12,13)7(17-5-21)19-1-2-20(4-3-19)8(18-6-22)10(14,15)16/h5-8,17-18H,1-4H2
36 atoms
Cl 4.035569 -1.307848 -1.249906
Cl 3.791662 1.544642 -1.550671
Cl 5.22183 0.458123 0.694527
Cl -5.221519 -0.459994 -0.695215
Cl -3.793249 -1.541281 1.553672
Cl -4.035087 1.310562 1.244768
O  2.055132 0.561602 3.231092
O  -2.061621 -0.574209 -3.23111
N  1.378822 0.168568 -0.409049
N  -1.378602 -0.171899 0.408808
N  2.607144 -0.77377 1.472166
N  -2.604981 0.767951 -1.474853
C  -0.46043 -1.297219 0.375047
C  0.685817 -1.092926 -0.610752
C  -0.685664 1.089682 0.610362
C  0.460771 1.293987 -0.375229
C  2.516482 0.231548 0.44831
C  -2.516218 -0.235016 -0.448462
C  3.833334 0.224795 -0.379967
C  -3.833381 -0.224694 0.379302
C  2.359614 -0.52129 2.771233
C  -2.359878 0.511233 -2.773503
H  -1.005016 -2.207204 0.119314
H  -0.06463 -1.451519 1.383686
H  -1.376443 1.930628 0.551059
H  -0.290902 1.101905 1.632732
H  0.29085 -1.104959 -1.633044
H  1.376575 -1.933901 -0.551752
H  1.005349 2.203901 -0.119137
H  0.065191 1.448593 -1.383923
H  2.523421 1.197252 0.958693
H  -2.524495 -1.201895 -0.956595
H  2.823775 -1.727919 1.223184
H  -2.817686 1.723555 -1.228017
H  2.4654 -1.422448 3.390533
H  -2.462206 1.411338 -3.394986
elementType: Cl O N C H
totalener: -3520.30678029 hartree
nucrepener: 3036.54898819 hartree
electener: -6556.85576848 hartree
twoeener: 4339.57258444 hartree
cpcmener: -0.03768897 hartree
kineticenergy: 3513.10453192 hartree
xcener: -198.311494819324 hartree
chargesum: -0.0000000
charge: -0.058655 -0.047705 -0.054315 -0.054248 -0.047707 -0.058680 -0.486843 -0.486761 -0.172425 -0.172326 -0.203480 -0.203574 -0.080382 -0.128576 -0.128726 -0.080653 0.001789 0.001739 0.134956 0.134778 0.258684 0.258575 0.088640 0.107581 0.094992 0.105510 0.105435 0.094986 0.088700 0.107580 0.130359 0.130288 0.184235 0.184264 0.125952 0.126010
qa: -0.0587 -0.0477 -0.0543 -0.0542 -0.0477 -0.0587 -0.4868 -0.4868 -0.1724 -0.1723 -0.2035 -0.2036 -0.0804 -0.1286 -0.1287 -0.0807 0.0018 0.0017 0.1350 0.1348 0.2587 0.2586 0.0886 0.1076 0.0950 0.1055 0.1054 0.0950 0.0887 0.1076 0.1304 0.1303 0.1842 0.1843 0.1260 0.1260
va: 1.2598 1.2568 1.2568 1.2569 1.2568 1.2597 2.0002 2.0002 2.7968 2.7966 3.0983 3.0982 3.8724 3.9550 3.9549 3.8726 4.0421 4.0425 4.5026 4.5028 4.1486 4.1485 1.0214 1.0078 1.0200 1.0214 1.0214 1.0199 1.0214 1.0080 1.0426 1.0429 1.0099 1.0098 0.9952 0.9951
dispcorr: -0.026792632 hartree
energy: -3520.333572924599
dipole: 0.01059 -0.00068 0.00991 -0.03119 0.03360 0.00241 -0.00168 -0.00005 -0.00173
magnitude: 0.01034 au
magnitude: 0.02629 debye
