program: Orca
programVersion: 4.2.1
elementType: Cl Cl Cl Cl Cl Cl O O N N N N C C C C C C C C C C H H H H H H H H H H H H H H
charge: 0
multiplicity: 1
keywords: wb97x-d3
keywords: def2-TZVPP
keywords: def2/J RIJCOSX GRIDX6 NOFINALGRIDX
keywords: grid4 nofinalgrid
keywords: scfconv7
keywords: smallprint printgap noloewdin
keywords: NOSOSCF
formula: C10H14Cl6N4O2
InChI: InChI=1S/C10H14Cl6N4O2/c11-9(12,13)7(17-5-21)19-1-2-20(4-3-19)8(18-6-22)10(14,15)16/h5-8,17-18H,1-4H2
36 atoms
Cl 5.312319 0.292672 0.931387
Cl 3.613512 1.821251 -0.812534
Cl 2.966643 1.583592 1.977153
Cl -3.589157 1.056334 -2.035678
Cl -5.402191 0.011303 -0.083845
Cl -3.330272 1.835005 0.72478
O  4.072536 -3.131369 0.177528
O  -3.834126 -3.312906 0.55263
N  1.396882 -0.458336 0.244129
N  -1.422359 -0.37841 0.100071
N  3.373551 -1.217966 -0.841683
N  -3.101852 -1.783218 -0.968091
C  -0.749456 -1.182769 1.110406
C  0.598701 -0.572312 1.44502
C  -0.614522 -0.306748 -1.105571
C  0.741274 0.304631 -0.793282
C  2.80726 -0.579457 0.31623
C  -2.80337 -0.719269 -0.044066
C  3.626764 0.726605 0.583904
C  -3.716999 0.499971 -0.352529
C  3.948945 -2.434894 -0.809577
C  -3.578476 -2.985301 -0.588429
H  -0.611483 -2.224715 0.783656
H  -1.352701 -1.198579 2.019581
H  -0.456937 -1.298981 -1.554315
H  -1.093007 0.321728 -1.853653
H  1.109124 -1.214116 2.164988
H  0.426894 0.396014 1.930345
H  0.603059 1.356953 -0.511216
H  1.326031 0.289354 -1.712943
H  3.03188 -1.216266 1.174651
H  -3.149427 -1.053958 0.93547
H  3.336311 -0.75323 -1.736092
H  -2.916042 -1.653321 -1.951484
H  4.307216 -2.739888 -1.802342
H  -3.714463 -3.658499 -1.446094
elementType: Cl O N C H
totalener: -3520.31024585 hartree
nucrepener: 2988.38819500 hartree
electener: -6508.69844085 hartree
twoeener: 4290.96532551 hartree
cpcmener: -0.03895649 hartree
kineticenergy: 3513.11066148 hartree
xcener: -198.307849619641 hartree
chargesum: 0.0000000
charge: -0.052761 -0.059919 -0.046031 -0.063404 -0.052385 -0.038056 -0.489732 -0.487459 -0.138632 -0.138775 -0.201160 -0.220306 -0.095966 -0.077523 -0.117002 -0.094325 -0.014800 0.015955 0.135043 0.130697 0.265748 0.269065 0.086017 0.093230 0.081154 0.110277 0.101551 0.081210 0.078430 0.092906 0.126022 0.122499 0.180424 0.183121 0.115881 0.119009
qa: -0.0528 -0.0599 -0.0460 -0.0634 -0.0524 -0.0381 -0.4897 -0.4875 -0.1386 -0.1388 -0.2012 -0.2203 -0.0960 -0.0775 -0.1170 -0.0943 -0.0148 0.0160 0.1350 0.1307 0.2657 0.2691 0.0860 0.0932 0.0812 0.1103 0.1016 0.0812 0.0784 0.0929 0.1260 0.1225 0.1804 0.1831 0.1159 0.1190
va: 1.2565 1.2485 1.2642 1.2440 1.2490 1.2697 2.0042 2.0006 2.9260 2.8488 3.0932 3.1043 3.9761 3.9227 3.9630 3.9762 4.0931 4.0186 4.4113 4.5025 4.1692 4.1593 1.0191 1.0099 1.0252 1.0201 1.0088 1.0152 1.0198 1.0046 1.0503 1.0559 1.0130 1.0097 0.9950 0.9954
dispcorr: -0.024451130 hartree
energy: -3520.334696975624
dipole: 1.42190 -1.21094 0.21096 -22.42565 23.34026 0.91462 -4.39083 1.61432 -2.77651
magnitude: 2.93088 au
magnitude: 7.44971 debye
