program: Orca
programVersion: 4.2.1
elementType: Cl Cl Cl Cl Cl Cl O O N N N N C C C C C C C C C C H H H H H H H H H H H H H H
charge: 0
multiplicity: 1
keywords: wb97x-d3
keywords: def2-TZVPP
keywords: def2/J RIJCOSX GRIDX6 NOFINALGRIDX
keywords: grid4 nofinalgrid
keywords: scfconv7
keywords: smallprint printgap noloewdin
keywords: NOSOSCF
formula: C10H14Cl6N4O2
InChI: InChI=1S/C10H14Cl6N4O2/c11-9(12,13)7(17-5-21)19-1-2-20(4-3-19)8(18-6-22)10(14,15)16/h5-8,17-18H,1-4H2
36 atoms
Cl 4.145935 -1.168061 -1.299413
Cl 3.366478 1.59278 -1.577391
Cl 5.34053 0.821846 0.370299
Cl -4.146076 1.169424 1.298098
Cl -5.340472 -0.821765 -0.37011
Cl -3.366916 -1.591169 1.57862
O  3.053393 0.282562 3.49389
O  -3.053447 -0.284996 -3.49378
N  1.399419 0.208247 0.15862
N  -1.399268 -0.20875 -0.158419
N  3.085054 -0.891119 1.541263
N  -3.084473 0.890133 -1.542008
C  -0.888399 1.01103 0.437141
C  0.440664 0.736011 1.114056
C  -0.440507 -0.736555 -1.113826
C  0.888553 -1.011557 -0.436893
C  2.735589 0.201972 0.668592
C  -2.73539 -0.202437 -0.668524
C  3.829055 0.354076 -0.424171
C  -3.829068 -0.353455 0.424182
C  3.219043 -0.743043 2.885098
C  -3.218772 0.741084 -2.885704
H  -1.573598 1.379886 1.197582
H  -0.748493 1.807392 -0.310512
H  -0.821244 -1.671755 -1.527586
H  -0.274838 -0.04877 -1.956068
H  0.275004 0.048206 1.956281
H  0.821382 1.67121 1.527834
H  1.573773 -1.380461 -1.197296
H  0.748631 -1.807871 0.310806
H  2.84019 1.109133 1.267196
H  -2.840157 -1.109986 -1.266509
H  3.244634 -1.802571 1.144151
H  -3.243666 1.801944 -1.145565
H  3.502165 -1.69241 3.36946
H  -3.501152 1.690308 -3.370781
totalener: -3520.28017232 hartree
nucrepener: 2986.73550909 hartree
electener: -6507.01568141 hartree
twoeener: 4289.82427566 hartree
kineticenergy: 3513.15602490 hartree
xcener: -198.305641984768 hartree
chargesum: 0.0000000
charge: -0.068038 -0.024829 -0.034673 -0.068057 -0.034656 -0.024813 -0.368639 -0.368636 -0.130861 -0.130904 -0.236680 -0.236685 -0.101714 -0.113711 -0.113729 -0.101840 -0.007220 -0.007149 0.137600 0.137515 0.234934 0.234931 0.101629 0.073051 0.087712 0.093397 0.093427 0.087668 0.101628 0.073097 0.132501 0.132522 0.146356 0.146367 0.079254 0.079246
qa: -0.0680 -0.0248 -0.0347 -0.0681 -0.0347 -0.0248 -0.3686 -0.3686 -0.1309 -0.1309 -0.2367 -0.2367 -0.1017 -0.1137 -0.1137 -0.1018 -0.0072 -0.0071 0.1376 0.1375 0.2349 0.2349 0.1016 0.0731 0.0877 0.0934 0.0934 0.0877 0.1016 0.0731 0.1325 0.1325 0.1464 0.1464 0.0793 0.0792
va: 1.2415 1.2841 1.2638 1.2414 1.2638 1.2841 2.1219 2.1219 2.8508 2.8509 3.0332 3.0333 3.8995 4.0400 4.0399 3.8994 4.0838 4.0840 4.4972 4.4973 4.2041 4.2041 1.0285 1.0265 1.0119 1.0180 1.0180 1.0119 1.0285 1.0264 1.0448 1.0447 1.0409 1.0408 1.0039 1.0039
dispcorr: -0.024671358 hartree
energy: -3520.304843676502
dipole: 0.00314 -0.00255 0.00059 -0.00963 0.00994 0.00030 -0.00104 0.00049 -0.00055
magnitude: 0.00087 au
magnitude: 0.00220 debye
