program: Orca
programVersion: 4.2.1
elementType: Cl Cl Cl Cl Cl Cl O O N N N N C C C C C C C C C C H H H H H H H H H H H H H H
charge: 0
multiplicity: 1
keywords: wb97x-d3
keywords: def2-TZVPP
keywords: def2/J RIJCOSX GRIDX6 NOFINALGRIDX
keywords: grid4 nofinalgrid
keywords: scfconv7
keywords: smallprint printgap noloewdin
keywords: NOSOSCF
formula: C10H14Cl6N4O2
InChI: InChI=1S/C10H14Cl6N4O2/c11-9(12,13)7(17-5-21)19-1-2-20(4-3-19)8(18-6-22)10(14,15)16/h5-8,17-18H,1-4H2
36 atoms
Cl 3.46424 -2.295085 -0.559754
Cl 2.955173 0.064915 -2.116087
Cl 5.332113 -0.106387 -0.502356
Cl -3.934568 2.102291 0.72338
Cl -5.053306 -0.218994 -0.570364
Cl -4.015716 -0.422913 2.102431
O  3.063261 1.521457 3.018969
O  -1.409891 -1.344189 -2.34181
N  1.440377 0.125364 0.540376
N  -1.36426 0.278308 0.90843
N  3.383829 -0.381932 1.819772
N  -2.254386 0.520004 -1.345937
C  -0.591022 -0.813362 1.462833
C  0.681557 -1.097719 0.673146
C  -0.565668 1.477508 0.759745
C  0.715209 1.234279 -0.032673
C  2.852009 0.149769 0.59193
C  -2.390166 -0.039756 -0.027858
C  3.612097 -0.523296 -0.59332
C  -3.790108 0.341243 0.533594
C  3.418893 0.3733 2.945471
C  -1.7894 -0.201788 -2.396076
H  -1.209085 -1.710339 1.519597
H  -0.318103 -0.550988 2.490102
H  -1.144909 2.27505 0.296475
H  -0.294841 1.830492 1.759595
H  0.42902 -1.536651 -0.301409
H  1.267646 -1.837542 1.21956
H  1.336922 2.130895 0.019477
H  0.474496 1.069973 -1.090204
H  3.151291 1.20037 0.533523
H  -2.431052 -1.124578 -0.154815
H  3.679417 -1.342469 1.869107
H  -2.556241 1.466465 -1.512285
H  3.827699 -0.189438 3.802225
H  -1.792397 0.388416 -3.327495
totalener: -3520.27523595 hartree
nucrepener: 3045.27960678 hartree
electener: -6565.55484273 hartree
twoeener: 4348.82926879 hartree
kineticenergy: 3513.15806796 hartree
xcener: -198.313749496292 hartree
chargesum: 0.0000000
charge: -0.057957 -0.035302 -0.043003 -0.059801 -0.042679 -0.034118 -0.373436 -0.370887 -0.078549 -0.154004 -0.218310 -0.217658 -0.069622 -0.127830 -0.114086 -0.098427 -0.043975 -0.034859 0.145058 0.147533 0.224371 0.225921 0.074282 0.092666 0.072328 0.108946 0.114062 0.081273 0.095438 0.079146 0.122861 0.133982 0.144172 0.149048 0.076702 0.086714
qa: -0.0580 -0.0353 -0.0430 -0.0598 -0.0427 -0.0341 -0.3734 -0.3709 -0.0785 -0.1540 -0.2183 -0.2177 -0.0696 -0.1278 -0.1141 -0.0984 -0.0440 -0.0349 0.1451 0.1475 0.2244 0.2259 0.0743 0.0927 0.0723 0.1089 0.1141 0.0813 0.0954 0.0791 0.1229 0.1340 0.1442 0.1490 0.0767 0.0867
va: 1.2550 1.2747 1.2677 1.2625 1.2698 1.2727 2.1240 2.1189 2.8538 2.8287 3.0420 3.0416 3.9861 3.8826 3.9941 3.8790 4.1595 4.1215 4.4018 4.4764 4.2134 4.1840 1.0195 1.0061 1.0244 1.0148 1.0194 1.0203 1.0162 1.0075 1.0314 1.0323 1.0496 1.0414 1.0033 1.0028
dispcorr: -0.026429290 hartree
energy: -3520.301665242522
dipole: 5.51285 -5.43951 0.07333 3.21465 -3.21314 0.00151 7.24270 -7.31197 -0.06927
magnitude: 0.10089 au
magnitude: 0.25644 debye
