program: Orca
programVersion: 4.2.1
elementType: Cl Cl Cl Cl Cl Cl O O N N N N C C C C C C C C C C H H H H H H H H H H H H H H
charge: 0
multiplicity: 1
keywords: wb97x-d3
keywords: def2-TZVPP
keywords: def2/J RIJCOSX GRIDX6 NOFINALGRIDX
keywords: grid4 nofinalgrid
keywords: scfconv7
keywords: smallprint printgap noloewdin
keywords: NOSOSCF
formula: C10H14Cl6N4O2
InChI: InChI=1S/C10H14Cl6N4O2/c11-9(12,13)7(17-5-21)19-1-2-20(4-3-19)8(18-6-22)10(14,15)16/h5-8,17-18H,1-4H2
36 atoms
Cl 3.768111 2.084325 0.005402
Cl 3.367329 0.449557 2.340828
Cl 5.419615 -0.20838 0.439919
Cl -5.42138 -0.218944 -0.403931
Cl -3.73635 2.091137 -0.398247
Cl -3.357562 0.043792 -2.386285
O  3.780082 -2.604915 -1.843343
O  -3.834023 -2.178322 2.279424
N  1.425387 -0.390361 0.204289
N  -1.429661 -0.402633 -0.119781
N  3.116151 -0.443967 -1.551047
N  -3.128562 -0.118444 1.604976
C  -0.704823 0.816168 0.206497
C  0.713393 0.761932 -0.327845
C  -0.715008 -1.55304 0.418626
C  0.695905 -1.609073 -0.123258
C  2.809909 -0.522572 -0.143107
C  -2.81672 -0.455952 0.237025
C  3.769182 0.420659 0.630677
C  -3.761595 0.340218 -0.702312
C  3.552066 -1.489523 -2.276244
C  -3.58744 -1.00697 2.504345
H  -0.669237 1.000519 1.289576
H  -1.178853 1.678358 -0.256142
H  -0.679718 -1.539254 1.517526
H  -1.228263 -2.468375 0.119773
H  1.196874 1.685303 -0.018571
H  0.678076 0.757857 -1.426553
H  0.658993 -1.788479 -1.207338
H  1.199926 -2.463598 0.331226
H  3.109356 -1.519408 0.185059
H  -3.125768 -1.492753 0.09415
H  2.940671 0.416099 -2.049173
H  -2.938942 0.814364 1.940399
H  3.686874 -1.225178 -3.332801
H  -3.722071 -0.552527 3.49422
elementType: Cl O N C H
totalener: -3520.30500564 hartree
nucrepener: 2982.02240310 hartree
electener: -6502.32740874 hartree
twoeener: 4284.30739284 hartree
cpcmener: -0.04705136 hartree
kineticenergy: 3513.10139695 hartree
xcener: -198.305295691462 hartree
chargesum: 0.0000000
charge: -0.059277 -0.036839 -0.052821 -0.053327 -0.059280 -0.037169 -0.518478 -0.518552 -0.147292 -0.145779 -0.223605 -0.223767 -0.121861 -0.120164 -0.091890 -0.090545 0.019546 0.017146 0.123997 0.125616 0.280759 0.280086 0.092310 0.103354 0.084698 0.099075 0.102522 0.092175 0.085142 0.098986 0.129950 0.130764 0.190764 0.191691 0.126035 0.126028
qa: -0.0593 -0.0368 -0.0528 -0.0533 -0.0593 -0.0372 -0.5185 -0.5186 -0.1473 -0.1458 -0.2236 -0.2238 -0.1219 -0.1202 -0.0919 -0.0905 0.0195 0.0171 0.1240 0.1256 0.2808 0.2801 0.0923 0.1034 0.0847 0.0991 0.1025 0.0922 0.0851 0.0990 0.1299 0.1308 0.1908 0.1917 0.1260 0.1260
va: 1.2445 1.2702 1.2440 1.2437 1.2452 1.2699 1.9628 1.9625 2.8704 2.8711 3.1064 3.1082 3.9749 3.9740 3.9759 3.9746 4.0393 4.0401 4.5071 4.5051 4.1407 4.1413 1.0211 1.0242 1.0193 1.0069 1.0240 1.0214 1.0188 1.0070 1.0524 1.0521 1.0051 1.0043 0.9939 0.9938
dispcorr: -0.024437379 hartree
energy: -3520.329443018764
dipole: -0.11832 0.14484 0.02652 -12.01272 14.95452 2.94180 1.18127 -1.44594 -0.26467
magnitude: 2.95380 au
magnitude: 7.50796 debye
