program: Orca
programVersion: 4.2.1
elementType: Cl Cl Cl Cl Cl Cl O O N N N N C C C C C C C C C C H H H H H H H H H H H H H H
charge: 0
multiplicity: 1
keywords: wb97x-d3
keywords: def2-TZVPP
keywords: def2/J RIJCOSX GRIDX6 NOFINALGRIDX
keywords: grid4 nofinalgrid
keywords: scfconv7
keywords: smallprint printgap noloewdin
keywords: NOSOSCF
formula: C10H14Cl6N4O2
InChI: InChI=1S/C10H14Cl6N4O2/c11-9(12,13)7(17-5-21)19-1-2-20(4-3-19)8(18-6-22)10(14,15)16/h5-8,17-18H,1-4H2
36 atoms
Cl 4.473741 0.191495 -1.627148
Cl 4.691945 1.573321 0.883989
Cl 4.194994 -1.263443 0.842129
Cl -3.321851 -1.020474 1.775232
Cl -2.608282 1.6035 0.839579
Cl -5.058377 0.368293 -0.037486
O  1.023732 2.845703 1.088063
O  -4.167063 -1.348252 -3.131831
N  1.646741 -0.396813 -0.821114
N  -1.211224 -0.542171 -0.868122
N  1.85105 0.737496 1.332418
N  -3.205946 -1.826773 -1.122827
C  -0.520634 0.578973 -1.48423
C  0.866478 0.141238 -1.922452
C  -0.490809 -1.167056 0.224547
C  0.93896 -1.499307 -0.195511
C  2.329048 0.565488 -0.012047
C  -2.632388 -0.530464 -0.872311
C  3.854844 0.272316 0.02277
C  -3.356994 0.074072 0.377197
C  1.228802 1.854704 1.759086
C  -3.899765 -2.125347 -2.237397
H  -0.426424 1.447406 -0.820365
H  -1.086302 0.905029 -2.359778
H  -0.478765 -0.544294 1.127657
H  -0.970045 -2.110065 0.496323
H  1.392998 0.98157 -2.376542
H  0.782052 -0.631302 -2.69259
H  0.910919 -2.320349 -0.917965
H  1.482368 -1.879563 0.668622
H  2.25427 1.543114 -0.492653
H  -2.942797 0.11447 -1.69629
H  1.948044 -0.014775 1.998291
H  -3.031777 -2.580556 -0.475747
H  0.918235 1.772621 2.809652
H  -4.211525 -3.1787 -2.251661
elementType: Cl O N C H
totalener: -3520.30701683 hartree
nucrepener: 3060.79871234 hartree
electener: -6581.10572917 hartree
twoeener: 4363.58179000 hartree
cpcmener: -0.03835802 hartree
kineticenergy: 3513.10281250 hartree
xcener: -198.310656715314 hartree
chargesum: -0.0000000
charge: -0.046266 -0.052444 -0.059634 -0.061924 -0.046095 -0.052816 -0.476560 -0.490046 -0.183394 -0.132822 -0.206190 -0.199745 -0.111472 -0.054998 -0.101073 -0.133130 0.010807 -0.005900 0.131629 0.147345 0.251881 0.264589 0.087589 0.103975 0.075414 0.105963 0.083089 0.090739 0.099278 0.096913 0.132195 0.121389 0.184914 0.181065 0.131409 0.114328
qa: -0.0463 -0.0524 -0.0596 -0.0619 -0.0461 -0.0528 -0.4766 -0.4900 -0.1834 -0.1328 -0.2062 -0.1997 -0.1115 -0.0550 -0.1011 -0.1331 0.0108 -0.0059 0.1316 0.1473 0.2519 0.2646 0.0876 0.1040 0.0754 0.1060 0.0831 0.0907 0.0993 0.0969 0.1322 0.1214 0.1849 0.1811 0.1314 0.1143
va: 1.2583 1.2580 1.2582 1.2421 1.2686 1.2551 2.0097 2.0037 2.8208 2.8903 3.1062 3.1012 3.8795 3.9481 3.8275 4.0281 4.0326 4.0737 4.5229 4.4107 4.1361 4.1729 1.0173 1.0169 1.0260 1.0086 1.0165 1.0103 1.0116 1.0160 1.0441 1.0550 1.0071 1.0122 0.9940 0.9952
dispcorr: -0.026592397 hartree
energy: -3520.333609225663
dipole: -6.44782 7.05978 0.61196 -8.25048 5.75053 -2.49994 -9.97284 11.66946 1.69662
magnitude: 3.08265 au
magnitude: 7.83548 debye
