program: Orca
programVersion: 4.2.1
elementType: Cl Cl Cl Cl Cl Cl O O N N N N C C C C C C C C C C H H H H H H H H H H H H H H
charge: 0
multiplicity: 1
keywords: wb97x-d3
keywords: def2-TZVPP
keywords: def2/J RIJCOSX GRIDX6 NOFINALGRIDX
keywords: grid4 nofinalgrid
keywords: scfconv7
keywords: smallprint printgap noloewdin
keywords: NOSOSCF
formula: C10H14Cl6N4O2
InChI: InChI=1S/C10H14Cl6N4O2/c11-9(12,13)7(17-5-21)19-1-2-20(4-3-19)8(18-6-22)10(14,15)16/h5-8,17-18H,1-4H2
36 atoms
Cl 3.850626 -1.599995 1.201259
Cl 3.895401 -1.327475 -1.663751
Cl 5.252057 0.604654 -0.021457
Cl -5.232117 -0.389822 -0.633214
Cl -3.927475 0.676589 1.705994
Cl -3.823247 2.112131 -0.786907
O  2.243611 3.245584 0.095893
O  -2.189808 -2.664285 -1.916515
N  1.379659 -0.384143 -0.332598
N  -1.3644 0.526948 -0.113361
N  2.540648 1.219498 1.090847
N  -2.574227 -1.582761 0.04958
C  -0.505853 0.948833 -1.208907
C  0.58435 -0.070799 -1.509083
C  -0.596904 0.183601 1.072357
C  0.547344 -0.789462 0.78772
C  2.534287 0.424895 -0.107113
C  -2.515714 -0.24153 -0.463769
C  3.826638 -0.440149 -0.140957
C  -3.817466 0.506675 -0.056381
C  2.390484 2.55783 1.086676
C  -2.403976 -2.674171 -0.720668
H  -0.04918 1.909332 -0.946183
H  -1.108396 1.131043 -2.099686
H  -0.19812 1.111469 1.492832
H  -1.238426 -0.236247 1.846548
H  1.233502 0.292018 -2.307039
H  0.130516 -0.996457 -1.879643
H  0.140178 -1.779264 0.561478
H  1.142506 -0.91756 1.691307
H  2.651333 1.119651 -0.942036
H  -2.575527 -0.321275 -1.551804
H  2.64185 0.77224 1.989971
H  -2.736405 -1.736911 1.033723
H  2.412133 2.975178 2.102738
H  -2.484735 -3.602063 -0.138018
elementType: Cl O N C H
totalener: -3520.30660349 hartree
nucrepener: 3038.45400285 hartree
electener: -6558.76060634 hartree
twoeener: 4341.36829541 hartree
cpcmener: -0.03852081 hartree
kineticenergy: 3513.10644438 hartree
xcener: -198.311491954480 hartree
chargesum: 0.0000000
charge: -0.060299 -0.045754 -0.054106 -0.054221 -0.060021 -0.046233 -0.484522 -0.484250 -0.174078 -0.174330 -0.207434 -0.207085 -0.077281 -0.078074 -0.131417 -0.132973 0.004316 0.002592 0.134655 0.135405 0.259595 0.258679 0.100644 0.087508 0.113156 0.095222 0.087725 0.101157 0.113824 0.095109 0.130851 0.131768 0.183969 0.184072 0.125701 0.126133
qa: -0.0603 -0.0458 -0.0541 -0.0542 -0.0600 -0.0462 -0.4845 -0.4842 -0.1741 -0.1743 -0.2074 -0.2071 -0.0773 -0.0781 -0.1314 -0.1330 0.0043 0.0026 0.1347 0.1354 0.2596 0.2587 0.1006 0.0875 0.1132 0.0952 0.0877 0.1012 0.1138 0.0951 0.1309 0.1318 0.1840 0.1841 0.1257 0.1261
va: 1.2585 1.2591 1.2572 1.2573 1.2588 1.2586 2.0033 2.0037 2.7919 2.7930 3.0998 3.0991 3.9045 3.9043 3.9245 3.9245 4.0387 4.0413 4.5057 4.5048 4.1491 4.1491 1.0174 1.0200 1.0123 1.0217 1.0196 1.0174 1.0119 1.0221 1.0434 1.0427 1.0100 1.0100 0.9950 0.9949
dispcorr: -0.026809593 hartree
energy: -3520.333413081712
dipole: -0.07531 -0.01501 -0.09032 -0.51567 -0.39252 -0.90819 1.52439 1.31051 2.83490
magnitude: 2.97819 au
magnitude: 7.56996 debye
