program: Orca
programVersion: 4.2.1
elementType: Cl Cl Cl Cl Cl Cl O O N N N N C C C C C C C C C C H H H H H H H H H H H H H H
charge: 0
multiplicity: 1
keywords: wb97x-d3
keywords: def2-TZVPP
keywords: def2/J RIJCOSX GRIDX6 NOFINALGRIDX
keywords: grid4 nofinalgrid
keywords: scfconv7
keywords: smallprint printgap noloewdin
keywords: NOSOSCF
formula: C10H14Cl6N4O2
InChI: InChI=1S/C10H14Cl6N4O2/c11-9(12,13)7(17-5-21)19-1-2-20(4-3-19)8(18-6-22)10(14,15)16/h5-8,17-18H,1-4H2
36 atoms
Cl 4.220814 0.121219 -1.931148
Cl 4.860761 1.335339 0.594472
Cl 4.153415 -1.458821 0.47473
Cl -3.532394 -0.813196 1.779474
Cl -2.975457 1.767638 0.651094
Cl -5.281907 0.278771 -0.222294
O  0.976993 2.633848 1.309082
O  -2.856753 -1.833694 -3.310519
N  1.497355 -0.339961 -0.79136
N  -1.338457 -0.384253 -0.762947
N  2.054444 0.628499 1.375057
N  -3.217612 -1.818712 -1.065528
C  -0.645104 0.723283 -1.388336
C  0.719708 0.248519 -1.865117
C  -0.621088 -1.013475 0.320392
C  0.776252 -1.41593 -0.147216
C  2.334974 0.530752 -0.032107
C  -2.747761 -0.472802 -0.864515
C  3.831309 0.148041 -0.216213
C  -3.589235 0.162452 0.28725
C  1.418153 1.695281 1.921944
C  -3.207117 -2.384188 -2.298634
H  -0.517645 1.579374 -0.714241
H  -1.227885 1.065343 -2.246209
H  -0.549983 -0.362146 1.201936
H  -1.145229 -1.918806 0.631419
H  1.274735 1.074664 -2.311323
H  0.585308 -0.504274 -2.647602
H  0.679074 -2.230631 -0.871721
H  1.344607 -1.817675 0.690694
H  2.255779 1.543868 -0.434985
H  -3.032516 0.10532 -1.747995
H  2.406299 -0.08333 1.994752
H  -3.507457 -2.37603 -0.27911
H  1.341902 1.602635 3.018108
H  -3.570073 -3.426038 -2.271571
totalener: -3520.27559757 hartree
nucrepener: 3052.17269990 hartree
electener: -6572.44829747 hartree
twoeener: 4355.63462011 hartree
kineticenergy: 3513.15226978 hartree
xcener: -198.311875914776 hartree
chargesum: 0.0000000
charge: -0.031395 -0.041845 -0.063041 -0.070476 -0.023023 -0.040725 -0.370769 -0.371681 -0.154599 -0.082827 -0.222874 -0.219570 -0.121710 -0.068532 -0.114828 -0.118094 -0.030115 -0.034806 0.149687 0.144283 0.229241 0.225988 0.111212 0.093282 0.083029 0.086102 0.072989 0.101087 0.098714 0.073073 0.134932 0.123211 0.149162 0.143846 0.085841 0.075233
qa: -0.0314 -0.0418 -0.0630 -0.0705 -0.0230 -0.0407 -0.3708 -0.3717 -0.1546 -0.0828 -0.2229 -0.2196 -0.1217 -0.0685 -0.1148 -0.1181 -0.0301 -0.0348 0.1497 0.1443 0.2292 0.2260 0.1112 0.0933 0.0830 0.0861 0.0730 0.1011 0.0987 0.0731 0.1349 0.1232 0.1492 0.1438 0.0858 0.0752
va: 1.2756 1.2711 1.2603 1.2401 1.2889 1.2681 2.1192 2.1257 2.8280 2.8615 3.0426 3.0381 3.9028 3.9429 3.8420 4.0515 4.1110 4.1452 4.4792 4.4014 4.1839 4.2150 1.0106 1.0186 1.0162 1.0193 1.0192 1.0106 1.0106 1.0241 1.0329 1.0314 1.0413 1.0500 1.0031 1.0034
dispcorr: -0.026480482 hartree
energy: -3520.302078047694
dipole: -5.20473 5.21978 0.01505 -7.07251 5.85612 -1.21639 -6.76259 8.02896 1.26638
magnitude: 1.75600 au
magnitude: 4.46340 debye
