program: Orca
programVersion: 4.2.1
elementType: Cl Cl Cl Cl Cl Cl O O N N N N C C C C C C C C C C H H H H H H H H H H H H H H
charge: 0
multiplicity: 1
keywords: wb97x-d3
keywords: def2-TZVPP
keywords: def2/J RIJCOSX GRIDX6 NOFINALGRIDX
keywords: grid4 nofinalgrid
keywords: scfconv7
keywords: smallprint printgap noloewdin
keywords: NOSOSCF
formula: C10H14Cl6N4O2
InChI: InChI=1S/C10H14Cl6N4O2/c11-9(12,13)7(17-5-21)19-1-2-20(4-3-19)8(18-6-22)10(14,15)16/h5-8,17-18H,1-4H2
36 atoms
Cl 3.653883 -0.961261 1.988544
Cl 3.360013 -2.283232 -0.545402
Cl 5.413543 -0.294677 -0.190079
Cl -5.396365 0.076445 -0.722191
Cl -3.835066 1.447697 1.271824
Cl -3.341786 1.93203 -1.517863
O  2.511532 2.929013 -1.339285
O  -2.329401 -3.225375 -0.576396
N  1.393284 0.030956 -0.263005
N  -1.3831 -0.098067 -0.364891
N  3.081061 1.576426 0.396374
N  -3.105208 -1.437136 0.591543
C  -0.630831 0.096823 -1.581622
C  0.745388 -0.529371 -1.42582
C  -0.750579 0.434074 0.814632
C  0.655117 -0.13755 0.962982
C  2.769184 0.3487 -0.287056
C  -2.745204 -0.464816 -0.406995
C  3.752767 -0.75109 0.222758
C  -3.782448 0.699794 -0.343393
C  2.898328 2.776264 -0.209291
C  -2.838383 -2.75397 0.407912
H  -0.512744 1.159559 -1.828539
H  -1.15538 -0.38135 -2.410635
H  -0.690395 1.530975 0.782066
H  -1.324614 0.164851 1.701342
H  1.344832 -0.313198 -2.311854
H  0.63269 -1.618633 -1.354089
H  0.584239 -1.195623 1.252426
H  1.154122 0.3907 1.775695
H  3.044084 0.479294 -1.337785
H  -2.919344 -0.919259 -1.386811
H  3.391347 1.558202 1.353629
H  -3.51752 -1.14188 1.460817
H  3.156657 3.614365 0.460651
H  -3.153091 -3.358752 1.275843
totalener: -3520.27573332 hartree
nucrepener: 3016.89756660 hartree
electener: -6537.17329992 hartree
twoeener: 4320.36239729 hartree
kineticenergy: 3513.15926159 hartree
xcener: -198.312763105153 hartree
chargesum: -0.0000000
charge: -0.066190 -0.030687 -0.041116 -0.041366 -0.065997 -0.030846 -0.371565 -0.371892 -0.097082 -0.096925 -0.219071 -0.218792 -0.086545 -0.088347 -0.098882 -0.099261 -0.049357 -0.053890 0.146717 0.148223 0.226333 0.225883 0.097137 0.086201 0.087151 0.074326 0.086169 0.098307 0.086733 0.075434 0.124442 0.126096 0.143378 0.143697 0.075745 0.075840
qa: -0.0662 -0.0307 -0.0411 -0.0414 -0.0660 -0.0308 -0.3716 -0.3719 -0.0971 -0.0969 -0.2191 -0.2188 -0.0865 -0.0883 -0.0989 -0.0993 -0.0494 -0.0539 0.1467 0.1482 0.2263 0.2259 0.0971 0.0862 0.0872 0.0743 0.0862 0.0983 0.0867 0.0754 0.1244 0.1261 0.1434 0.1437 0.0757 0.0758
va: 1.2476 1.2798 1.2696 1.2701 1.2483 1.2798 2.1254 2.1250 2.8927 2.8910 3.0392 3.0395 3.9467 3.9448 3.9774 3.9730 4.1610 4.1668 4.3956 4.3940 4.2119 4.2112 1.0142 1.0121 1.0129 1.0181 1.0122 1.0145 1.0132 1.0173 1.0301 1.0280 1.0498 1.0498 1.0034 1.0034
dispcorr: -0.025386170 hartree
energy: -3520.301119493854
dipole: 0.24911 -0.35922 -0.11011 0.19753 0.05026 0.24778 -0.48945 2.16155 1.67210
magnitude: 1.69395 au
magnitude: 4.30567 debye
