program: Orca
programVersion: 4.2.1
elementType: Cl Cl Cl Cl Cl Cl O O N N N N C C C C C C C C C C H H H H H H H H H H H H H H
charge: 0
multiplicity: 1
keywords: wb97x-d3
keywords: def2-TZVPP
keywords: def2/J RIJCOSX GRIDX6 NOFINALGRIDX
keywords: grid4 nofinalgrid
keywords: scfconv7
keywords: smallprint printgap noloewdin
keywords: NOSOSCF
formula: C10H14Cl6N4O2
InChI: InChI=1S/C10H14Cl6N4O2/c11-9(12,13)7(17-5-21)19-1-2-20(4-3-19)8(18-6-22)10(14,15)16/h5-8,17-18H,1-4H2
36 atoms
Cl 4.07166 0.489217 -1.568469
Cl 4.079171 1.867233 0.960053
Cl 5.044217 -0.838852 0.797143
Cl -5.053123 -0.594053 -0.570103
Cl -4.064003 0.625259 1.847884
Cl -3.987358 2.076425 -0.637502
O  0.943549 -2.391296 1.513886
O  -1.026558 -2.281162 -1.306505
N  1.404913 0.748415 0.231479
N  -1.369521 0.837447 0.118207
N  2.242835 -1.494901 -0.121142
N  -2.295827 -1.387965 0.354195
C  -0.606119 1.458913 -0.935481
C  0.786952 0.850384 -1.075791
C  -0.747343 0.825653 1.428163
C  0.682626 1.351816 1.323591
C  2.407924 -0.211884 0.50741
C  -2.398871 -0.075325 -0.222843
C  3.841733 0.304949 0.185136
C  -3.817532 0.483979 0.093221
C  1.497955 -2.472216 0.442678
C  -1.593966 -2.377192 -0.243144
H  -0.537317 2.538489 -0.767308
H  -1.133359 1.349612 -1.88314
H  -1.2957 1.438863 2.15241
H  -0.704539 -0.192681 1.823445
H  1.372206 1.470276 -1.764667
H  0.682919 -0.139271 -1.529167
H  1.198918 1.145694 2.261227
H  0.684338 2.442733 1.227163
H  2.420861 -0.388584 1.585898
H  -2.39392 -0.207178 -1.307912
H  2.58098 -1.637837 -1.058842
H  -2.656121 -1.554442 1.279761
H  1.460493 -3.373271 -0.188088
H  -1.606847 -3.303303 0.351023
totalener: -3520.27448201 hartree
nucrepener: 3083.38924279 hartree
electener: -6603.66372480 hartree
twoeener: 4387.25501372 hartree
kineticenergy: 3513.15423365 hartree
xcener: -198.322736834714 hartree
chargesum: -0.0000000
charge: -0.062936 -0.038721 -0.042871 -0.043024 -0.062279 -0.038948 -0.404671 -0.404886 -0.128754 -0.132835 -0.204944 -0.204832 -0.071853 -0.120475 -0.119293 -0.072887 -0.009154 -0.008149 0.134548 0.134724 0.216819 0.218769 0.101405 0.082330 0.071865 0.094777 0.071500 0.095906 0.083157 0.101423 0.129013 0.129808 0.150867 0.150793 0.102080 0.101728
qa: -0.0629 -0.0387 -0.0429 -0.0430 -0.0623 -0.0389 -0.4047 -0.4049 -0.1288 -0.1328 -0.2049 -0.2048 -0.0719 -0.1205 -0.1193 -0.0729 -0.0092 -0.0081 0.1345 0.1347 0.2168 0.2188 0.1014 0.0823 0.0719 0.0948 0.0715 0.0959 0.0832 0.1014 0.1290 0.1298 0.1509 0.1508 0.1021 0.1017
va: 1.2556 1.2693 1.2682 1.2685 1.2572 1.2689 2.0753 2.0751 2.9128 2.9118 3.0959 3.0995 3.9709 3.9799 3.9803 3.9715 4.1210 4.1159 4.4498 4.4549 4.1919 4.1904 0.9870 1.0126 1.0081 1.0159 1.0089 1.0148 1.0120 0.9867 1.0269 1.0262 1.0430 1.0427 1.0024 1.0024
dispcorr: -0.028129132 hartree
energy: -3520.302611136807
dipole: -0.08221 0.08448 0.00226 -5.76251 5.96084 0.19833 0.21922 -0.21016 0.00906
magnitude: 0.19855 au
magnitude: 0.50467 debye
