program: Gaussian 09
title: 000003121
version: EM64L-G09RevD.01
frameworkgroup: C1[X(C8H16O2)]
method: RPBEPBE
basis: SDD
operation: Freq
keyword: #pfreq=noraman
keyword: PBEPBE/SDD
title: #p freq=noraman PBEPBE/SDD
converged: NO YES NO NO
title: Mulliken charges:
elementType: O O C C C C C C C C H H H H H H H H H H H H H H H H
charge: -0.415268 -0.239191 -0.100563 -0.402890 -0.402677 -0.358352 -0.358296 0.134597 -0.696907 -0.696861 0.229057 0.196790 0.218594 0.218436 0.196938 0.214106 0.198150 0.214059 0.198355 0.215247 0.218049 0.207822 0.207893 0.218078 0.215144 0.369691
chargesum: 0.00000
title: Mulliken charges with hydrogens summed into heavy atoms:
elementType: O O C C C C C C C C
charge: -0.045577 -0.239191 0.128494 0.012494 0.012697 0.053903 0.054118 0.134597 -0.055789 -0.055746
polarizability: 1.03655637e+02 2.32076586e-02 9.20910713e+01 -8.50083472e-02 -1.24076363e+00 8.24136066e+01
1716.lowfreq: -0.0003 0.0005 0.0008 8.4129 9.9472 12.7457 30.8270 64.1571 67.9198
frequency: 30.8095 64.1136 67.9187 76.1960 91.9935 96.7083 184.8186 234.2500 235.2683 251.1698 258.0473 292.5513 340.7951 458.0199 487.5825 585.9902 638.1683 718.8487 727.8374 751.0131 775.8994 858.5500 875.0907 909.5347 919.6428 998.7432 1024.5579 1045.7152 1056.4127 1065.3476 1080.6016 1113.7096 1126.0100 1142.4105 1220.4133 1224.2274 1250.5936 1253.7481 1288.3246 1289.6690 1301.8681 1315.2543 1346.4939 1357.0503 1375.3760 1390.6264 1391.2829 1456.2490 1463.7312 1471.1931 1472.4618 1478.6103 1478.7961 1485.0023 1485.8492 1655.2724 2969.4360 2969.9631 2974.2347 2974.5934 2977.8601 2980.9996 3011.2989 3012.3703 3021.8591 3042.0270 3052.1914 3070.9005 3071.7265 3074.9823 3075.2094 3492.1726
redmass: 7.6395 3.1168 1.5832 1.6552 3.9900 3.2593 2.4427 1.1351 1.1290 2.6971 3.3482 3.6452 3.6662 3.0979 3.2955 3.2725 1.2518 1.6588 1.4946 1.7807 1.6150 1.2891 2.0825 1.5034 1.4741 4.9442 1.7586 2.3852 2.4063 1.7704 2.2801 2.1554 1.8096 2.5487 1.4116 1.4279 1.4748 1.2138 1.2147 1.0988 1.1894 1.3083 1.5370 1.5487 1.6345 1.2123 1.2202 1.0769 1.0777 1.0668 1.0704 1.0418 1.0424 1.0718 1.0746 7.7116 1.0579 1.0576 1.0373 1.0383 1.0595 1.0588 1.0957 1.0995 1.0911 1.1040 1.1001 1.1008 1.1007 1.0995 1.0994 1.0636
irintensity: 2.4380 0.1015 0.0397 0.0398 0.1392 0.0426 0.0407 0.0515 0.0286 0.1384 3.1209 0.2209 2.0074 3.5677 25.7451 6.3690 122.6680 27.7723 19.4459 12.3668 3.4016 1.0075 3.8456 0.7959 0.0181 33.0355 0.9554 221.4153 2.5466 16.5161 13.3010 1.5784 18.8155 6.9785 0.3359 1.2294 4.2959 1.2895 0.6243 0.3444 3.6158 0.1953 0.1648 4.7588 26.9914 11.9931 5.9037 0.0003 4.9682 1.9878 7.7125 1.4599 24.0753 6.1107 26.0659 171.1903 4.0067 23.6614 45.7045 9.5266 0.1746 110.6487 5.0238 0.2611 10.3083 0.0522 30.4848 6.7598 154.4427 38.5860 65.3653 16.5235
temp: 298.150 k
press: 1.00000 atm
elementType: 8 8 6 6 6 6 6 6 6 6 1 1 1 1 1 1 1 1 1 1 1 1 1 1 1 1
symmnumber: 1
zpe: 596985.9 jmol-1
zpe.correction: 0.227380 hartree
zpe.thermalcorrener: 0.240181 hartree
zpe.thermalcorrenthalpy: 0.241125 hartree
zpe.thermalcorrgfe: 0.187010 hartree
zpe.sumelectzpe: -464.081514 hartree
zpe.sumelectthermal: -464.068713 hartree
zpe.sumelectthermalent: -464.067769 hartree
zpe.sumelectthermalfe: -464.121885 hartree
dipole: 0.0150 -0.6123 -1.3984
dipole: 1.5267
quadrupole: -61.4910 -57.9629 -68.5656
quadrupole: 0.0427 0.0447 -1.9581
quadrupole: 1.1822 4.7103 -5.8925 0.0427 0.0447 -1.9581
hfenergy: -464.3088944 hartree
pointgroup: C01 [X(C8H16O2)]
dipole: 0.0060946 0.2641247 0.539416 debye
dipolederiv: -0.4071631 0.0052205 -0.0071775 0.0072981 -0.6805802 0.5445882 -0.0068647 0.4511794 -0.7567062 -0.3543274 0.0028633 -0.0040358 -0.0006667 -0.6510504 -0.2245265 -0.0074376 0.0127787 -0.8798407 -0.129385 -0.001962 -0.0006342 -0.0012616 -0.2252394 -0.0114615 0.0001865 0.0314706 0.1011291 0.0477027 -0.0832197 -0.0088318 -0.049455 0.1148767 0.0362755 0.0395781 -0.0234285 0.1000341 0.0484523 0.0848774 0.009103 0.049514 0.1153245 0.0356442 -0.0397412 -0.0245058 0.101422 0.0210082 0.0105676 -0.0046438 0.0386877 0.0988207 0.0395443 -0.0339935 0.0463574 0.1439378 0.0212894 -0.0106216 0.0048349 -0.0393422 0.0982891 0.039739 0.0340076 0.0463058 0.1436098 0.2039333 -0.0088787 0.012762 -0.006905 1.2761699 -0.16377 0.0158528 -0.2493408 1.2937185 -0.0633869 0.0504989 -0.0206332 0.0216175 0.072458 0.0217294 0.0079479 0.0148503 0.0765634 -0.0630603 -0.0513379 0.020931 -0.0219881 0.0718985 0.0219373 -0.0075819 0.0149103 0.0769458 0.0583936 0.0003621 -0.0003431 0.0001595 0.0437771 0.0029119 -0.0003392 -0.0030405 -0.1226623 0.0341561 0.0005261 0.0004169 -0.0212369 -0.1780263 -0.0388737 -0.008766 -0.0462199 0.0630268 0.0378543 0.0001082 0.0154236 -0.0045901 0.0789733 -0.0192612 -0.0018907 0.0279686 -0.1323891 0.0373995 -0.0004182 -0.016234 0.0037733 0.0782824 -0.0186851 0.0009755 0.0285618 -0.1328698 0.0340042 -0.0001457 0.0000116 0.0221677 -0.1776963 -0.0397879 0.0094417 -0.046628 0.0625697 0.0394072 0.0089339 0.0028474 -0.0038018 -0.1785502 -0.0360154 -0.0018776 -0.0613434 0.0540248 0.0236533 0.0067218 -0.0460344 0.0033671 0.0689179 0.0005629 -0.0039367 0.0212678 -0.1873695 0.039217 -0.0076475 -0.0025868 0.0052702 -0.1780395 -0.0373134 0.0019385 -0.0625889 0.0535147 0.0241465 -0.0070738 0.0450866 -0.0035182 0.0688024 0.0019367 0.0030306 0.0223783 -0.1870142 0.0828543 0.0119558 0.0108465 0.0205667 0.0787633 -0.015041 -0.0565248 0.0091074 -0.1754369 -0.1797346 -0.0477759 0.0698302 -0.085606 0.0537813 0.0442258 0.0933369 0.040808 0.059278 0.0756768 -0.0388018 -0.0228326 0.0331064 -0.171953 -0.0574012 -0.017222 -0.0704155 0.0659798 0.0758633 0.0396188 0.0233086 -0.0322065 -0.1711013 -0.0585197 0.0173543 -0.0718561 0.0650321 -0.1810943 0.0470329 -0.06856 0.0850937 0.053963 0.0434041 -0.0918665 0.040044 0.0605609 0.0832326 -0.0117946 -0.0121435 -0.020961 0.0785659 -0.0135502 0.0551545 0.0109435 -0.1758228 0.3899071 0.0003901 -0.0007117 0.0009172 0.1605728 -0.0982924 -0.0007623 -0.1595645 0.2287641 unknown
polarizability: 103.6558792|0.0042585|91.967788|0.0594066|-1.6481713|82.5366477 unknown
InChI: InChI=1S/C8H16O2/c1-3-5-7(6-4-2)8(9)10/h7,9H,3-6H2,1-2H3
charge 0 multiplicity 1
26 atoms
O  0.022459 -2.139476 0.960152
O  -0.003452 -1.650038 -1.305867
C  0.001755 0.209513 0.33169
C  -1.284977 0.912688 -0.18826
C  1.283311 0.920206 -0.192379
C  -2.597884 0.334054 0.385642
C  2.601961 0.346894 0.373425
C  0.005619 -1.24259 -0.12135
C  -3.841459 1.106581 -0.104097
C  3.838888 1.128989 -0.117851
H  0.004067 0.217486 1.437578
H  -1.214026 1.987498 0.074093
H  -1.301132 0.849268 -1.294279
H  1.294337 0.860874 -1.298714
H  1.207695 1.993641 0.074176
H  -2.69224 -0.731828 0.096927
H  -2.556611 0.355232 1.493375
H  2.701668 -0.717201 0.079981
H  2.565013 0.362859 1.481402
H  -3.921074 1.069726 -1.206754
H  -4.771495 0.682193 0.316013
H  -3.79113 2.171186 0.193542
H  3.784497 2.191557 0.186234
H  4.773126 0.706959 0.295211
H  3.913278 1.099065 -1.221092
H  0.025507 -3.071937 0.607003
