program: Gaussian 09
title: 000034371
version: EM64L-G09RevD.01
frameworkgroup: C1[X(C17H22ClNO)]
method: RPBEPBE
basis: SDD
operation: Freq
keyword: #p
keyword: freq=noraman
keyword: PBEPBE/SDD
title: #p freq=noraman PBEPBE/SDD
converged: NO YES NO NO
title: Mulliken charges:
elementType: Cl O N C C C C C C C C C C C C C C C C C H H H H H H H H H H H H H H H H H H H H H H
charge: -0.053708 -0.276266 -0.109813 -0.166791 -0.152386 -0.047885 -0.058548 -0.532530 -0.485270 -0.467459 -0.542775 -0.785004 -0.631838 0.114689 0.298240 -0.365512 -0.338565 -0.210756 -0.224039 -0.100024 0.244642 0.233506 0.220628 0.213657 0.226585 0.226591 0.229950 0.204872 0.210591 0.222702 0.253598 0.228453 0.212982 0.221261 0.219928 0.236881 0.265505 0.220753 0.268807 0.258343 0.258271 0.257736
chargesum: 0.00000
title: Mulliken charges with hydrogens summed into heavy atoms:
elementType: Cl O N C C C C C C C C C C C C C C C C C
charge: -0.053708 -0.276266 -0.109813 0.077851 0.081119 0.172744 0.155109 -0.079354 -0.050448 -0.034166 -0.060724 -0.130832 0.091300 0.114689 0.298240 -0.096706 -0.080222 0.047516 0.033697 -0.100024
polarizability: 2.30751848e+02 -3.38855724e+01 1.78593148e+02 -7.54943482e+00 -5.74238077e+00 1.75069832e+02
1716.lowfreq: -10.7320 -7.3237 -0.0023 -0.0014 0.0005 7.6675 20.6437 25.5159 42.0684
frequency: 19.1595 22.4900 41.9783 61.7756 73.8128 90.8002 103.3091 141.5824 152.0956 171.6927 196.4931 226.6706 235.9212 254.6889 277.0702 289.8352 316.1724 325.4189 366.0448 374.3461 409.6459 435.9620 447.2349 469.0991 476.4157 507.6113 543.8820 555.9753 620.0980 664.3057 684.7423 728.2703 730.4352 738.8629 748.1751 797.6308 805.4776 828.5210 833.4435 842.1353 882.5034 903.0058 905.4218 919.9865 928.4328 959.4271 961.4480 969.2161 971.9625 989.2108 999.8167 1007.1750 1028.2617 1053.1052 1058.2143 1071.8136 1072.6363 1093.2086 1102.4155 1107.6899 1115.8533 1123.7471 1144.2241 1162.3757 1173.6317 1182.9892 1191.6550 1212.8236 1232.7821 1240.9099 1252.7140 1261.0189 1268.0472 1282.6005 1288.4897 1291.9664 1303.0329 1316.3745 1330.1488 1345.1019 1355.7241 1364.4171 1388.9724 1389.9797 1393.4637 1424.4297 1456.7515 1462.2267 1466.3624 1472.3929 1476.1144 1476.8536 1484.8165 1494.8398 1497.6996 1549.1836 1581.9417 1595.0610 2940.0811 2962.3210 2971.6698 2976.1152 2986.8642 2993.5231 3003.9077 3010.1510 3044.8879 3048.9134 3058.3080 3059.8936 3060.5938 3066.5675 3069.7487 3075.6660 3081.2831 3116.1214 3140.7983 3154.3142 3170.7400 3175.4552
redmass: 4.9241 3.8697 5.7921 3.8629 5.0877 3.3941 3.3747 1.1854 4.7341 3.0953 1.2824 2.5719 3.3223 6.1913 4.8721 2.2388 3.9340 2.5487 3.0155 2.8582 2.9111 2.2453 3.0064 6.2164 3.1639 3.0881 3.3662 3.6372 6.9916 5.6952 5.2923 4.5974 3.9512 3.5485 3.7225 1.7537 2.1080 1.8965 1.2958 1.6154 2.3967 3.1867 2.4606 2.0452 2.7664 1.3544 1.6021 1.7224 1.4039 1.4686 3.4074 1.8150 1.5490 1.9344 2.0344 2.3590 1.9219 1.5683 1.7208 1.3784 1.3619 1.2982 1.6341 1.7655 2.1261 1.1184 1.9075 1.4434 1.6775 2.5722 1.5153 1.3772 1.5656 1.6092 1.3541 1.2583 1.5379 1.4442 1.5648 1.3447 1.5104 4.1726 1.6723 1.8381 2.3122 1.2683 1.1042 1.1270 1.0666 1.0662 2.2943 1.0688 1.0792 1.1514 1.0906 5.8994 7.5973 6.2819 1.0829 1.0690 1.0364 1.0432 1.0784 1.0592 1.0601 1.0638 1.0913 1.0985 1.0915 1.0987 1.0978 1.1026 1.1018 1.1034 1.0933 1.0998 1.0893 1.0888 1.0958 1.0975
irintensity: 0.0796 0.0034 0.8720 0.5792 2.4437 1.0685 0.0180 0.2313 2.0344 0.3192 0.6758 1.0531 1.4926 1.1212 2.4530 0.4929 4.9378 2.7284 1.7766 4.7937 0.3603 3.1908 9.8793 21.8248 2.9783 10.4504 3.3547 6.7660 1.1201 8.0887 11.8543 9.3820 8.8753 17.6207 4.3820 1.0468 4.3544 2.2102 10.9565 56.6026 9.0330 1.4943 3.9404 6.5887 1.7095 2.0734 1.6474 6.2492 2.4007 4.4165 51.5639 2.2322 3.1794 6.4281 43.9110 48.9913 9.2996 7.0973 10.5629 7.9633 7.7338 1.7468 7.1308 4.9036 0.8668 3.7163 2.7495 12.6491 2.5114 38.1230 28.4373 10.9269 29.8553 2.4457 0.6090 1.7457 2.1506 5.2430 28.5436 3.6832 30.2682 6.6256 40.0565 8.5587 87.2618 76.5174 24.7335 4.5953 7.8561 3.6548 13.1896 13.3972 11.8785 3.1330 5.6703 226.3080 32.8337 53.9117 21.6135 44.9617 35.6008 21.9673 57.7072 37.2670 30.2462 61.0134 68.8333 20.0983 5.4287 29.0867 35.6088 20.2524 62.4829 67.8123 19.0106 8.0563 5.9155 0.7919 4.5888 1.0369
temp: 298.150 k
press: 1.00000 atm
elementType: 17 8 7 6 6 6 6 6 6 6 6 6 6 6 6 6 6 6 6 6 1 1 1 1 1 1 1 1 1 1 1 1 1 1 1 1 1 1 1 1 1 1
symmnumber: 1
zpe: 925992.6 jmol-1
zpe.correction: 0.352692 hartree
zpe.thermalcorrener: 0.371834 hartree
zpe.thermalcorrenthalpy: 0.372778 hartree
zpe.thermalcorrgfe: 0.303245 hartree
zpe.sumelectzpe: -1249.544618 hartree
zpe.sumelectthermal: -1249.525476 hartree
zpe.sumelectthermalent: -1249.524532 hartree
zpe.sumelectthermalfe: -1249.594065 hartree
dipole: -3.6161 -1.7928 2.1203
dipole: 4.5591
quadrupole: -132.4731 -138.4158 -120.8426
quadrupole: -3.4622 -0.6733 7.9794
quadrupole: -1.8959 -7.8386 9.7345 -3.4622 -0.6733 7.9794
hfenergy: -1249.89731 hartree
pointgroup: C01 [X(C17H22Cl1N1O1)]
dipole: -1.45708 0.4414532 -0.9483732 debye
polarizability: 221.1225426|40.0892531|186.6986852|6.4755014|-4.0458373|176.5936008 unknown
InChI: InChI=1S/C17H22ClNO/c1-11-13-3-4-14(9-13)16(11)10-19(2)17(20)12-5-7-15(18)8-6-12/h5-8,11,13-14,16H,3-4,9-10H2,1-2H3
charge 0 multiplicity 1
42 atoms
Cl 5.167899 2.562951 -0.241518
O  1.245732 -2.730373 1.445894
N  -0.132761 -2.002631 -0.28358
C  -1.925308 0.301367 0.964395
C  -2.943545 1.911837 -0.291764
C  -2.091281 -0.388616 -0.42767
C  -2.729719 0.750726 -1.321057
C  -1.65125 1.782718 0.566022
C  -3.338131 0.415559 1.612415
C  -4.039138 1.530581 0.748579
C  -0.761029 -0.894836 -1.042305
C  -3.962364 0.309209 -2.131682
C  -0.928922 -3.23777 -0.138777
C  0.989431 -1.875572 0.533365
C  1.948476 -0.73337 0.292033
C  2.50614 -0.083258 1.422064
C  2.414405 -0.385274 -1.002027
C  3.47792 0.927942 1.269993
C  3.400676 0.611323 -1.171671
C  3.906956 1.262076 -0.030154
H  -1.176201 -0.180681 1.615146
H  -3.111388 2.889878 -0.77479
H  -2.797495 -1.238708 -0.348005
H  -1.960101 1.102333 -2.042848
H  -0.721894 1.926117 -0.014776
H  -1.632458 2.465346 1.434579
H  -3.261355 0.719575 2.672192
H  -3.88021 -0.547721 1.582006
H  -4.972832 1.180573 0.275336
H  -4.298561 2.409565 1.366513
H  -0.050455 -0.05519 -1.093928
H  -0.952292 -1.234711 -2.081978
H  -3.695502 -0.486044 -2.853467
H  -4.759815 -0.092443 -1.480052
H  -4.388498 1.152429 -2.707256
H  -1.676145 -3.16046 0.674249
H  -0.254666 -4.07153 0.109727
H  -1.451885 -3.441996 -1.089758
H  2.184581 -0.392392 2.421591
H  2.03297 -0.913261 -1.882895
H  3.899801 1.436724 2.141387
H  3.771212 0.869406 -2.167731
