program: Gaussian 09
title: 000034273
version: EM64L-G09RevD.01
frameworkgroup: C1[X(C7H16N2O)]
method: RPBEPBE
basis: SDD
operation: Freq
keyword: #p
keyword: freq=noraman
keyword: PBEPBE/SDD
title: #p freq=noraman PBEPBE/SDD
converged: YES YES NO NO
title: Mulliken charges:
elementType: O N N C C C C C C C H H H H H H H H H H H H H H H H
charge: -0.296031 -0.053252 0.052049 -0.355637 -0.355627 -0.347694 -0.378019 -0.353878 -0.692468 -0.642273 0.181443 0.199510 0.225626 0.196322 0.192923 0.185354 0.205434 0.246019 0.196630 0.192885 0.217015 0.211885 0.209385 0.247705 0.273818 0.240875
chargesum: 0.00000
title: Mulliken charges with hydrogens summed into heavy atoms:
elementType: O N N C C C C C C C
charge: -0.296031 -0.053252 0.052049 0.025316 0.066320 0.030583 0.073435 0.035636 -0.054183 0.120126
polarizability: 1.11368044e+02 7.05138058e+00 8.83236140e+01 7.39838739e+00 1.78200924e+00 8.89819387e+01
1716.lowfreq: -20.1820 0.0002 0.0003 0.0006 5.1283 13.2912 25.8481 46.4186 64.5792
frequency: 25.1372 46.1091 64.5638 85.3719 90.5957 129.8029 137.6606 165.5027 225.2317 230.2288 318.8404 340.4978 368.9695 375.4662 406.6783 504.5986 629.1605 728.1851 756.4192 800.3496 825.1766 863.7806 887.1079 935.1949 977.4075 989.8848 1025.6056 1074.9968 1078.2317 1092.2769 1097.6769 1119.3704 1170.7536 1204.6982 1242.0683 1251.0681 1271.1867 1287.4323 1290.7236 1294.9349 1316.1479 1343.9056 1348.9178 1354.8117 1366.5889 1387.6218 1404.3359 1455.3508 1457.4805 1463.7819 1465.5825 1469.8360 1477.0709 1478.6085 1483.6845 1487.9773 2951.2586 2956.7108 2967.8784 2973.0532 2975.4821 2980.3058 2993.3505 3004.8284 3009.6861 3030.1062 3047.7803 3069.8235 3071.1242 3072.4556 3073.0355 3100.2905
redmass: 4.8634 1.8039 3.2159 1.1189 2.3636 1.9388 2.7056 2.6672 4.2469 1.1211 3.0812 3.8855 2.2726 4.4062 3.3770 2.6659 3.3734 1.0716 1.2280 3.1437 1.6453 1.7846 1.8191 1.7422 2.0365 1.7056 3.4988 2.1223 2.2600 1.6936 1.3166 2.0629 2.2245 1.5545 1.3892 2.3643 1.5251 1.0605 1.3885 1.2931 1.4935 1.7376 1.6132 1.7771 1.5824 1.2151 1.2252 1.0837 1.0862 1.0667 1.0557 1.0738 1.0427 1.0697 1.0569 1.0871 1.0597 1.0594 1.0596 1.0365 1.0615 1.0334 1.0957 1.0672 1.0935 1.1023 1.1022 1.1008 1.0995 1.1042 1.0993 1.1008
irintensity: 4.5143 0.6855 1.7020 0.3840 0.2818 0.4720 1.1333 1.0791 1.0271 0.0287 2.2912 3.1582 5.5564 0.5768 2.8071 3.2095 0.7515 11.4502 1.5253 10.9252 4.4470 13.5687 3.1398 45.7024 102.7655 11.5592 2.8261 7.9091 2.3601 3.7329 0.7610 4.5726 18.0625 4.0036 15.6566 15.7204 2.2915 1.5380 29.2504 27.2496 31.7694 28.3133 6.8477 24.3457 5.4243 11.7804 36.7704 16.6088 3.5027 1.4204 11.4396 1.3031 12.9130 0.6968 17.6464 19.2325 6.5089 9.8519 61.7621 30.8830 64.0491 31.5381 5.5738 26.7720 6.8493 12.3109 83.5261 78.2137 29.7088 26.5691 53.0133 3.0098
temp: 298.150 k
press: 1.00000 atm
elementType: 8 7 7 6 6 6 6 6 6 6 1 1 1 1 1 1 1 1 1 1 1 1 1 1 1 1
symmnumber: 1
zpe: 594830.0 jmol-1
zpe.correction: 0.226559 hartree
zpe.thermalcorrener: 0.239525 hartree
zpe.thermalcorrenthalpy: 0.240469 hartree
zpe.thermalcorrgfe: 0.185452 hartree
zpe.sumelectzpe: -460.166937 hartree
zpe.sumelectthermal: -460.153971 hartree
zpe.sumelectthermalent: -460.153027 hartree
zpe.sumelectthermalfe: -460.208044 hartree
dipole: 3.0496 1.5922 3.3969
dipole: 4.8347
quadrupole: -76.6885 -62.0749 -64.1153
quadrupole: -4.7074 -10.4980 -1.7861
quadrupole: -9.0623 5.5513 3.5109 -4.7074 -10.4980 -1.7861
hfenergy: -460.3934962 hartree
pointgroup: C01 [X(C7H16N2O1)]
dipole: -1.1620079 -1.3192622 0.7261829 debye
dipolederiv: -0.6245976 -0.4207102 0.1721975 -0.5669423 -0.814083 0.242854 -0.2901378 -0.3262674 -0.2031165 -0.5357212 -0.2454118 0.0000277 -0.2813591 -0.5344526 0.0196148 0.3249719 0.4240331 -0.2981515 0.533332 0.692821 -0.2966157 0.8479334 0.8689956 -0.4293938 -0.2351021 -0.2318289 0.0380184 -0.0498184 0.0624666 0.0039721 0.0823467 0.1503836 -0.0371281 0.0236606 -0.0611449 0.0655627 0.0084166 0.0532897 -0.0010653 0.0290137 0.0718391 0.0138026 -0.0530662 0.0051727 0.090022 0.0071599 0.0593114 0.0246364 0.0526905 0.161824 -0.022962 0.0597998 -0.0170711 0.0720019 0.3496669 0.0859231 0.1189242 0.184904 0.3959378 0.0668893 0.1686877 0.0754693 0.1741079 0.024217 0.0358359 0.0018318 0.032401 0.159179 -0.0179805 -0.0435562 -0.0160914 0.1063315 -0.0673767 0.0417014 -0.0124849 0.0514886 0.0826507 -0.00135 0.0266196 -0.0057203 0.0615495 0.1386804 -0.1465347 0.0683233 -0.2131848 -0.0152924 0.0627621 0.0312583 -0.0355883 0.1312169 0.0433777 0.0127875 0.005039 0.0251283 -0.0596393 0.1325528 -0.0044486 0.1164487 -0.087281 0.0304018 -0.0570711 -0.0430786 -0.1059389 -0.0914279 -0.100134 -0.0460318 -0.082686 -0.0122685 0.0403861 0.0027526 0.0226696 0.0176117 -0.027746 0.12034 0.0240289 0.0797199 -0.0288948 -0.0267755 -0.1128982 -0.0707789 -0.0648404 -0.0838814 -0.117326 -0.0391559 -0.1016937 0.0136279 0.0404205 -0.002961 0.0211444 0.0086443 -0.0452547 0.1315408 -0.0001608 0.1088811 -0.082015 -0.0075731 -0.0641252 -0.0403596 -0.0760063 -0.1067552 -0.1135774 -0.043205 -0.0894011 0.0027159 0.0478783 -0.0351885 -0.0243583 -0.0324996 -0.0515104 0.0719967 -0.0628594 0.1343195 -0.0307189 -0.0569117 0.0536084 0.0696275 -0.0047737 0.041164 -0.0400884 0.0463474 -0.1205362 -0.0380228 -0.0194034 -0.0934098 -0.0624721 -0.0769292 -0.0926618 -0.1099109 -0.0310499 -0.0849624 0.0091478 0.0361383 0.0274868 -0.0097778 0.0175772 -0.0605202 0.1540754 0.0094526 0.1157246 -0.0861876 -0.0807722 0.0673064 0.1078205 0.0805241 0.0666398 -0.0622462 0.1474824 -0.0715129 -0.0575129 0.0679821 -0.024578 0.0169589 0.0152852 -0.0429808 0.1342716 -0.0411686 0.1445557 -0.0472539 0.0238154 -0.0566241 -0.0447724 -0.1170281 -0.0969171 -0.0932499 -0.0820437 -0.0800284 0.0442997 -0.0655909 0.0233709 0.099425 0.0175375 0.1231282 0.0132554 0.0960495 0.047098 0.0277855 0.0996612 -0.0528191 -0.0726112 -0.054623 0.0293274 -0.1065366 0.0023381 0.0112401 0.1307078 0.0430065 0.0936702 -0.054223 0.1310393 -0.0279466 0.0879287 0.0112893 0.0618705 0.0043282 unknown
polarizability: 111.0934509|10.1443661|90.3790064|-2.6370024|-1.2394615|87.2011397 unknown
InChI: InChI=1S/C7H16N2O/c1-3-4-5-6-7-9(2)8-10/h3-7H2,1-2H3
charge 0 multiplicity 1
26 atoms
O  3.554354 1.492855 -0.334677
N  2.256335 -0.319507 0.036388
N  2.877364 0.531955 -0.863097
C  -0.873435 -0.534568 0.117693
C  0.052662 -0.995517 -1.029528
C  -2.309088 -0.224333 -0.363923
C  1.477572 -1.410677 -0.59199
C  -3.239855 0.262913 0.770157
C  -4.671374 0.572296 0.281461
C  2.380781 -0.174314 1.497792
H  -0.91299 -1.318536 0.904051
H  -0.451176 0.374081 0.592614
H  0.141461 -0.190068 -1.784409
H  -0.404173 -1.866657 -1.542998
H  -2.268914 0.547437 -1.160571
H  -2.745372 -1.131715 -0.831841
H  1.429314 -2.243415 0.134135
H  2.046631 -1.756276 -1.473368
H  -2.802487 1.170277 1.234529
H  -3.277996 -0.507337 1.56763
H  -5.315495 0.921775 1.109078
H  -4.662456 1.359915 -0.495459
H  -5.143729 -0.32643 -0.158234
H  1.385253 -0.160924 1.972661
H  2.904945 0.777856 1.688276
H  2.972769 -1.005986 1.92363
