program: Gaussian 09
title: 000003189
version: EM64L-G09RevD.01
frameworkgroup: C1[X(C17H30N2O5)]
method: RPBEPBE
basis: SDD
operation: Freq
keyword: #p
keyword: freq=noraman
keyword: PBEPBE/SDD
title: #p freq=noraman PBEPBE/SDD
converged: YES YES NO NO
title: Mulliken charges:
elementType: O O O O O N N C C C C C C C C C C C C C C C C C H H H H H H H H H H H H H H H H H H H H H H H H H H H H H H
charge: -0.271152 -0.269712 -0.266806 -0.269989 -0.222923 -0.382282 -0.352942 -0.221227 -0.221915 -0.215998 -0.382264 0.202754 0.008736 0.193452 0.304077 -0.735676 -0.723982 -0.354506 -0.418370 -0.024035 -0.702731 -0.712692 -0.230488 -0.669988 0.287685 0.265353 0.261729 0.220194 0.192605 0.215547 0.365680 0.218394 0.197644 0.260118 0.223818 0.264745 0.214259 0.190412 0.214542 0.217604 0.204616 0.186994 0.306835 0.213989 0.216366 0.207358 0.217915 0.213237 0.212669 0.233834 0.236084 0.233215 0.231688 0.215530
chargesum: 0.00000
title: Mulliken charges with hydrogens summed into heavy atoms:
elementType: O O O O O N N C C C C C C C C C C C C C C C C C
charge: -0.271152 -0.269712 -0.266806 -0.269989 -0.222923 -0.016602 -0.046107 0.066458 0.043438 0.045731 0.030536 0.202754 0.224284 0.193452 0.304077 -0.066261 -0.087221 0.061531 0.065566 0.162959 -0.065017 -0.068871 0.239430 0.010445
polarizability: 2.77808982e+02 4.02421642e+00 1.94668201e+02 -7.49304740e+00 -2.64174929e+00 1.83791139e+02
1716.lowfreq: -4.3078 -0.0012 -0.0008 -0.0004 3.1685 5.6232 8.9637 15.0664 19.5053
frequency: 8.2852 12.7596 19.2354 28.6396 29.6019 36.1039 39.5934 51.3545 54.8573 62.9769 72.9730 94.5197 98.5491 114.8771 128.4442 135.8118 157.6158 179.6389 202.1399 216.1010 218.2463 225.2568 234.6471 238.1297 244.0190 249.5389 276.4162 298.3364 304.1257 316.5917 332.7854 348.7060 370.7591 394.0224 400.8289 406.3899 416.0447 434.4521 462.3636 509.3411 517.4900 577.1379 615.5554 654.9572 681.6095 697.8730 708.0528 728.2330 753.0885 762.9051 774.3338 797.4861 813.0999 816.8199 826.1849 837.6985 852.7826 896.7410 914.2176 922.5126 925.5449 933.7505 948.8126 954.2503 955.9971 973.9867 979.5420 1002.1026 1017.3021 1021.9146 1065.8402 1074.2956 1079.2358 1104.1980 1113.5746 1128.2440 1134.4632 1135.2683 1138.8704 1139.4435 1160.5572 1178.1435 1178.5009 1188.4256 1210.8111 1224.2379 1227.7965 1244.4982 1249.9802 1260.8772 1273.5637 1274.1533 1305.1595 1311.2000 1326.9912 1329.2771 1340.1934 1342.6614 1351.9533 1354.6248 1365.2352 1379.9754 1380.8560 1391.9000 1397.0578 1399.4590 1402.9636 1450.0752 1451.8570 1457.7704 1463.2279 1466.2927 1468.9114 1472.2917 1474.3154 1474.3960 1481.1875 1485.0153 1485.1991 1487.9238 1490.7348 1499.7630 1501.9148 1603.4622 1623.9808 1642.7473 2943.3338 2961.8768 2965.2395 2968.4056 2968.6021 2970.4860 2973.3523 2980.8215 2997.9724 3006.1497 3013.4825 3016.9028 3035.7620 3036.3442 3057.3780 3059.9446 3064.1070 3065.6447 3069.3167 3071.0819 3073.2818 3073.3636 3079.6046 3082.0735 3094.4819 3110.4579 3137.5745 3143.7270 3444.2245 3550.9343
redmass: 4.0299 3.4506 4.4310 3.7602 4.6117 2.6643 4.0978 2.8948 3.7065 4.7462 3.9969 4.7873 3.5156 3.7136 4.3347 3.2222 3.2079 4.3403 1.8062 1.1520 1.9791 1.8641 3.3459 1.2643 1.1620 1.6602 3.0096 4.0412 2.8179 4.1525 4.0142 2.9890 2.2617 2.6903 2.3079 2.6826 2.1446 2.7406 8.7351 3.3935 2.1043 1.3300 5.0796 5.8153 5.0031 5.2562 3.9086 5.1191 1.4621 3.3006 3.2499 1.1140 4.2779 2.4289 2.8899 3.6735 1.7329 2.4015 1.2149 1.3575 1.7869 5.1219 1.9220 1.5729 1.4824 2.1714 2.4619 2.0481 1.9921 2.3325 1.3938 1.7344 1.9621 2.6216 2.3106 2.2440 1.9533 1.4746 3.1750 2.2413 2.5313 1.7445 1.7690 1.8626 1.5873 1.3799 1.3059 1.4570 1.1340 1.3097 1.4880 1.3715 1.2575 1.3526 1.4524 1.4795 1.4915 1.3735 1.4676 1.4360 1.3343 1.2106 1.2147 2.5539 1.2108 1.2137 1.3241 1.1101 1.0843 1.1106 1.0398 1.0686 1.0576 1.0642 1.0484 1.0515 1.0651 1.0602 1.0676 2.1431 1.0559 1.3657 1.3246 9.4592 6.1808 11.0074 1.0823 1.0597 1.0376 1.0362 1.0406 1.0470 1.0490 1.0775 1.0359 1.0661 1.0582 1.0889 1.0964 1.0968 1.0983 1.0993 1.0986 1.0991 1.0991 1.0991 1.1067 1.0992 1.1012 1.0991 1.0985 1.1028 1.0920 1.0893 1.0769 1.0774
irintensity: 0.2411 0.9846 1.4196 0.6225 1.4393 0.1053 1.4398 1.3790 1.4575 0.2970 3.8859 3.8947 0.6036 1.6733 1.0959 2.5645 6.6112 1.8996 5.1560 2.0662 8.3949 10.1772 5.1132 2.2437 1.2442 4.4553 1.5749 4.2856 1.8740 9.6886 46.2080 14.3667 0.4926 1.1287 1.2581 4.3573 4.8391 7.6312 6.6662 4.8923 3.0168 94.7627 10.1213 2.4552 17.5215 1.3177 31.2599 5.6673 73.0534 22.4400 25.0311 2.7618 9.8584 8.6989 3.6340 9.9875 13.4900 1.4781 4.2128 6.0562 0.0768 22.5648 7.3122 0.7201 2.8458 0.3755 4.2152 3.8080 32.6526 56.6761 2.7362 11.3237 5.1732 1.4611 24.0191 6.2128 9.9348 9.8719 426.1865 4.2531 12.1170 4.0751 14.0107 1.9717 21.0852 3.8393 6.7446 18.5286 0.0756 17.7961 6.9177 78.1764 2.0479 35.9226 9.4139 35.7620 27.8940 19.0282 4.2142 2.6750 5.2259 18.6296 27.1699 52.1187 20.1431 22.6614 13.8797 45.1336 0.9363 51.8345 12.6886 18.8198 5.0553 5.6527 8.7667 8.1980 9.8996 5.5990 9.4188 458.9976 13.7107 117.5991 35.0093 273.4008 77.8715 161.9038 28.8244 19.2453 27.2853 23.2560 43.6587 27.8745 42.0793 40.4310 19.0566 23.0021 16.0994 2.2479 63.2930 25.1974 8.9581 20.8169 89.0585 36.5200 64.7865 45.8140 4.7867 69.4731 8.0294 21.9265 27.7376 40.1164 0.5846 5.2083 72.2586 17.2772
temp: 298.150 k
press: 1.00000 atm
elementType: 8 8 8 8 8 7 7 6 6 6 6 6 6 6 6 6 6 6 6 6 6 6 6 6 1 1 1 1 1 1 1 1 1 1 1 1 1 1 1 1 1 1 1 1 1 1 1 1 1 1 1 1 1 1
symmnumber: 1
zpe: 1195957.9 jmol-1
zpe.correction: 0.455516 hartree
zpe.thermalcorrener: 0.484505 hartree
zpe.thermalcorrenthalpy: 0.485449 hartree
zpe.thermalcorrgfe: 0.389528 hartree
zpe.sumelectzpe: -1149.513259 hartree
zpe.sumelectthermal: -1149.484270 hartree
zpe.sumelectthermalent: -1149.483326 hartree
zpe.sumelectthermalfe: -1149.579247 hartree
dipole: -2.2825 3.6774 -1.0529
dipole: 4.4544
quadrupole: -103.8403 -154.7981 -156.7101
quadrupole: 13.9274 -13.5985 -4.2975
quadrupole: 34.6092 -16.3486 -18.2606 13.9274 -13.5985 -4.2975
hfenergy: -1149.9687755 hartree
pointgroup: C01 [X(C17H30N2O5)]
dipole: 0.9880713 -1.3949991 -0.3859259 debye
polarizability: 276.5908154|8.448068|195.3529078|10.1448625|3.3157165|184.324599 unknown
InChI: InChI=1S/C17H30N2O5/c1-6-23-17(22)14-13(24-14)16(21)19-12(9-11(4)5)15(20)18-8-7-10(2)3/h10-14,18-19H,6-9H2,1-5H3
charge 0 multiplicity 1
54 atoms
O  -2.69155 1.621584 -0.533158
O  -1.058727 -0.237517 2.284359
O  -5.514168 -0.578219 -0.935117
O  1.6735 1.655009 -1.277373
O  -5.542573 1.287764 0.476502
N  -0.287316 0.387501 0.157969
N  3.271153 1.051072 0.314432
C  -2.571814 0.926166 0.796613
C  -3.421052 0.31858 -0.291586
C  1.085508 -0.102927 0.331946
C  1.325474 -1.46866 -0.382787
C  -1.233976 0.307931 1.148188
C  0.505784 -2.658199 0.181731
C  2.030612 0.956348 -0.277065
C  -4.918207 0.431337 -0.187208
C  0.902141 -3.00243 1.637292
C  0.673936 -3.886464 -0.744517
C  5.425145 1.185028 -0.996094
C  4.334141 1.937331 -0.198015
C  6.215986 0.110333 -0.203019
C  7.178357 -0.645683 -1.150203
C  6.995779 0.714422 0.990215
C  -7.01395 -0.610713 -0.915824
C  -7.440381 -1.787981 -1.784474
H  -3.093582 1.425011 1.621961
H  -3.038459 -0.52974 -0.868829
H  1.258594 -0.217183 1.418616
H  1.094506 -1.331675 -1.458058
H  2.406158 -1.71497 -0.315262
H  -0.564892 -2.367517 0.179567
H  -0.471542 0.969132 -0.672087
H  4.946205 0.711766 -1.87589
H  6.140064 1.937898 -1.389069
H  3.835925 2.671718 -0.854118
H  4.777361 2.486906 0.653175
H  0.652053 -2.179089 2.329007
H  0.35494 -3.897781 1.985548
H  1.98593 -3.222994 1.709272
H  0.357779 -3.660544 -1.780359
H  0.070583 -4.739019 -0.382072
H  1.731451 -4.214017 -0.777089
H  5.488909 -0.631599 0.194825
H  3.466237 0.472563 1.133277
H  7.726433 -1.441664 -0.612808
H  6.631226 -1.113537 -1.989756
H  7.927143 0.047843 -1.579689
H  7.560904 -0.069223 1.527872
H  6.331633 1.206879 1.72478
H  7.722836 1.470958 0.636457
H  -7.340035 -0.713409 0.134927
H  -7.379532 0.358848 -1.298921
H  -7.083516 -1.664131 -2.820963
H  -7.04131 -2.737147 -1.388239
H  -8.543306 -1.855797 -1.802681
