program: Gaussian 09
title: 000034222
version: EM64L-G09RevD.01
frameworkgroup: C1[X(C11H11N)]
method: RPBEPBE
basis: SDD
operation: Freq
keyword: #pfreq=noraman
keyword: PBEPBE/SDD
title: #p freq=noraman PBEPBE/SDD
converged: NO YES NO NO
title: Mulliken charges:
elementType: N C C C C C C C C C C C H H H H H H H H H H H
charge: -0.010994 0.264390 -0.202802 0.354591 0.429006 -0.396522 -0.428994 -0.349788 -0.247017 -0.811820 -0.793771 -0.371243 0.239701 0.235928 0.228590 0.224906 0.236764 0.231244 0.236772 0.206768 0.244310 0.244407 0.235573
chargesum: 0.00000
title: Mulliken charges with hydrogens summed into heavy atoms:
elementType: N C C C C C C C C C C C
charge: -0.010994 0.264390 -0.202802 0.354591 0.429006 -0.156821 -0.193066 -0.121197 -0.022111 -0.107040 -0.098286 -0.135670
polarizability: 1.65487785e+02 1.10910505e+01 1.49993666e+02 1.67512712e-03 -4.71468529e-03 5.89141485e+01
1716.lowfreq: -4.7798 0.0005 0.0007 0.0008 18.1305 18.1835 93.8937 126.4908 165.2989
frequency: 93.8926 126.4903 165.2978 187.4695 207.6471 242.3635 257.2274 313.0499 458.1931 465.8624 474.7032 485.0679 513.2436 521.2642 591.3204 624.2354 648.0496 773.5276 798.8508 823.0777 837.2545 852.1065 880.8184 905.7324 959.1710 977.7653 982.0727 1015.8336 1044.3390 1049.1903 1064.7400 1099.9675 1157.9156 1185.0180 1216.1709 1250.2875 1268.3318 1334.0639 1364.3735 1389.6620 1398.2967 1398.5822 1415.7297 1450.9387 1459.6105 1468.9658 1470.1609 1477.9351 1510.8315 1566.1204 1593.3292 1616.0701 2977.9873 2988.6440 3054.8178 3073.0551 3090.9920 3092.8524 3115.1290 3121.9984 3135.5877 3146.0387 3157.1051
redmass: 3.2990 1.0473 1.3117 2.3883 3.0390 3.0738 3.1192 2.8040 5.4376 3.2985 3.2053 3.5705 6.1828 5.3715 3.6600 5.2883 3.1485 1.3729 5.3824 3.8806 4.9916 1.2185 4.0261 1.3791 1.4232 1.6753 1.3405 1.6946 1.5818 1.5736 2.2409 1.5655 2.6754 1.4576 2.2487 1.8546 2.1423 3.7847 2.7215 1.7712 1.2455 1.3766 3.0502 1.0465 2.7030 1.0458 1.1584 1.1430 4.4121 6.3814 6.1301 5.9865 1.0376 1.0359 1.0971 1.0963 1.1012 1.0987 1.0885 1.0863 1.0908 1.0960 1.0991
irintensity: 1.6299 0.2347 0.1479 5.5785 2.6480 2.3292 3.7166 0.3433 0.1018 0.1475 0.6794 1.2331 3.3816 5.5947 0.0711 0.0298 0.0171 44.6798 2.6876 3.2040 3.8835 51.8967 2.7614 0.0102 0.1949 0.1129 0.4752 2.2919 5.4426 10.5714 6.0219 4.1880 1.4723 0.7892 2.3111 2.7453 0.4806 4.8318 2.8336 6.3738 2.0749 48.5704 5.1691 12.6566 11.7211 15.2224 32.6501 3.4194 38.3383 15.1610 13.8416 3.4780 23.7722 27.3035 16.2776 13.3449 21.4623 22.2722 18.8994 6.9216 17.3223 38.5070 29.5729
temp: 298.150 k
press: 1.00000 atm
elementType: 7 6 6 6 6 6 6 6 6 6 6 6 1 1 1 1 1 1 1 1 1 1 1
symmnumber: 1
zpe: 492780.3 jmol-1
zpe.correction: 0.187690 hartree
zpe.thermalcorrener: 0.197860 hartree
zpe.thermalcorrenthalpy: 0.198804 hartree
zpe.thermalcorrgfe: 0.152498 hartree
zpe.sumelectzpe: -479.691228 hartree
zpe.sumelectthermal: -479.681058 hartree
zpe.sumelectthermalent: -479.680114 hartree
zpe.sumelectthermalfe: -479.726420 hartree
dipole: -1.5407 1.8083 0.0004
dipole: 2.3756
quadrupole: -59.4650 -67.1845 -74.7880
quadrupole: 2.1286 0.0007 -0.0003
quadrupole: 7.6808 -0.0387 -7.6422 2.1286 0.0007 -0.0003
hfenergy: -479.8789185 hartree
pointgroup: C01 [X(C11H11N1)]
dipole: 0.4957698 -0.7923216 0.0001762 debye
dipolederiv: -0.4672715 0.0050974 0.0000018 0.0240292 -0.3426949 -0.0000002 0.0000148 -0.0000636 -0.2255568 -0.2454984 0.091285 -0.000015 0.259299 -0.072906 -0.0000079 -0.0000091 -0.000006 0.0512483 0.1779651 0.2981777 0.0000165 -0.0075852 0.0111973 0.0000365 -0.0000084 0.000029 -0.0003426 0.3131696 -0.0774756 0.0000166 -0.2264694 0.359382 0.0000025 0.0000468 -0.0000354 -0.0215175 0.119521 -0.2206751 -0.0000711 -0.3019162 0.275441 0.000098 -0.0002644 0.0002569 -0.000726 -0.1097997 -0.0367585 0.0000291 -0.0381001 -0.0001865 -0.0000326 0.0000183 -0.0000151 -0.1891623 0.1180942 -0.0226954 -0.0000248 0.1015444 -0.2205002 -0.0000418 -0.0000032 -0.0000409 -0.187714 0.0129135 0.0575993 0.000012 0.0648425 -0.4310716 -0.0000008 0.0000238 0.0000117 -0.1387702 -0.0065319 0.0042299 -0.0000047 -0.0048632 0.1820512 0.0000191 0.0000204 -0.000014 -0.1379317 0.0039662 0.081092 -0.0000132 0.1542176 -0.1168334 0.0000075 -0.0000727 0.0000556 0.0505132 0.0760189 0.0693884 0.0001369 0.1788793 -0.1646996 0.0000071 0.0004819 -0.0002776 0.0302532 0.213203 -0.0950636 0.0000121 0.0450597 0.448628 0.0000134 -0.0000072 0.0000384 -0.0639934 0.0274047 0.114625 -0.0000057 0.0650463 -0.0516008 0.0000043 -0.0000018 0.000019 0.1513043 -0.1436209 -0.0208424 -0.0000041 0.0009297 0.0878416 0.0000173 -0.0000289 0.0000149 0.1535701 -0.1419459 -0.0417361 -0.0000047 -0.0082672 0.0908689 -0.0000069 -0.0000006 -0.0000163 0.1556111 0.0417055 -0.0845882 -0.000005 -0.0857528 -0.1035691 0.0000008 -0.0000126 0.0000017 0.1559624 0.0777605 -0.015211 -0.0579552 0.0352644 -0.0025969 -0.0948812 -0.004492 -0.1100693 -0.0322351 -0.1409122 -0.0079533 0.0000492 -0.1276865 0.0656143 0.0000268 0.0000508 -0.0000017 0.1090901 0.0777637 -0.0151312 0.0579052 0.0353245 -0.0025546 0.0948611 0.0044643 0.1100506 -0.0323175 -0.1792899 0.0051353 -0.000339 -0.1188343 0.060969 -0.0001629 -0.0003748 0.0000153 0.1042037 0.0774126 -0.0015288 -0.0539354 0.0285086 0.0199519 -0.0858124 -0.0020034 -0.1085278 -0.0281456 0.0774756 -0.0019991 0.0542025 0.0281604 0.0198314 0.0858617 0.0021678 0.1085824 -0.0274857 0.0204962 -0.0849717 -0.000004 -0.1016308 -0.112563 -0.0000093 -0.0000103 -0.0000078 0.1241421 unknown
polarizability: 168.3618239|8.3797735|147.1196276|-0.0009687|0.0049088|58.9141485 unknown
InChI: InChI=1S/C11H11N/c1-8-6-7-12-11-9(2)4-3-5-10(8)11/h3-7H,1-2H3
charge 0 multiplicity 1
23 atoms
N  0.11172 1.857698 0.000281
C  0.436657 -0.613836 0.000211
C  -0.409095 0.56813 0.00022
C  1.870497 -0.430636 0.000232
C  -1.847766 0.431755 0.000213
C  -0.179415 -1.907359 0.000212
C  -2.396608 -0.857837 0.000196
C  2.358506 0.882243 0.000302
C  -1.5702 -2.023427 0.000217
C  2.813945 -1.616541 0.000239
C  -2.719606 1.668789 0.000354
C  1.451261 1.98621 0.000326
H  0.445112 -2.806977 0.000242
H  -3.487033 -0.973271 0.000179
H  3.437318 1.07285 0.000331
H  -2.038222 -3.014352 0.000219
H  2.658213 -2.256144 -0.889006
H  3.86503 -1.283549 0.000002
H  2.658531 -2.255863 0.889749
H  -3.789793 1.398729 -0.001172
H  -2.508021 2.299608 0.881901
H  -2.505786 2.301414 -0.879311
H  1.838953 3.012568 0.000363
