program: Gaussian 09
title: 000034239
version: EM64L-G09RevD.01
frameworkgroup: C1[X(C12H10Cl2N2O)]
method: RPBEPBE
basis: SDD
operation: Freq
keyword: #p
keyword: freq=noraman
keyword: PBEPBE/SDD
title: #p freq=noraman PBEPBE/SDD
converged: YES YES NO NO
title: Mulliken charges:
elementType: Cl Cl O N N C C C C C C C C C C C C H H H H H H H H H H
charge: -0.080393 -0.080539 -0.303845 -0.687261 -0.687313 0.342473 0.342383 -0.360239 -0.359652 -0.391072 -0.391061 0.583403 0.583202 -0.291110 -0.291448 -0.358553 -0.358539 0.289481 0.289429 0.255313 0.255263 0.224147 0.224118 0.317824 0.308142 0.317770 0.308077
chargesum: 0.00000
title: Mulliken charges with hydrogens summed into heavy atoms:
elementType: Cl Cl O N N C C C C C C C C C C C C
charge: -0.080393 -0.080539 -0.303845 -0.061295 -0.061467 0.342473 0.342383 -0.070758 -0.070224 -0.135758 -0.135799 0.583403 0.583202 -0.291110 -0.291448 -0.134406 -0.134420
polarizability: 2.55943990e+02 1.66990540e-01 1.63491031e+02 -2.66630016e+01 2.05927819e-02 1.09178295e+02
1716.lowfreq: 0.0010 0.0020 0.0021 3.8767 5.6649 12.0794 21.7482 28.5634 41.5890
frequency: 21.2821 28.5558 41.5846 124.7161 125.5162 165.9763 181.6410 216.0365 246.3315 257.5945 280.2145 324.5156 340.1812 352.7160 360.3259 367.4440 386.3062 417.0052 419.6678 440.3314 443.2580 449.9732 464.9009 509.5342 530.3947 556.0010 601.2418 652.0832 680.9432 699.0398 705.1661 753.6580 800.4079 804.5961 807.1766 856.1573 856.5281 885.2772 891.0496 930.8461 931.9204 1009.7032 1010.7270 1035.8682 1037.3679 1142.9307 1143.0685 1159.6720 1198.2506 1266.3126 1267.6732 1321.7232 1328.3498 1363.2638 1379.3258 1420.5240 1425.4598 1490.3461 1507.6690 1563.3775 1574.8358 1616.1128 1618.5871 1645.5687 1646.6430 3134.4439 3134.6022 3170.8613 3172.2938 3173.4866 3174.4099 3559.4690 3559.8780 3706.7366 3706.8342
redmass: 5.9832 8.3172 9.9621 5.2533 5.6323 6.2133 6.2811 10.2641 6.8996 5.2629 5.0144 3.1548 1.6666 1.4689 2.3906 6.7268 8.3354 1.6790 1.4958 1.5658 1.7929 3.9706 3.7833 6.8275 4.5002 3.6984 4.5279 6.8348 7.9936 3.7369 4.0433 6.0811 5.0619 1.5200 1.5576 1.4511 5.3739 1.4330 6.4514 1.3434 1.3458 2.2073 2.1512 1.6981 1.6908 1.1882 1.1633 2.5682 2.6021 1.5037 1.4596 2.6021 3.2948 4.9026 5.5279 5.3894 5.1629 3.4521 3.6457 7.1917 7.1931 1.4822 1.4600 3.1345 3.3794 1.0893 1.0893 1.0927 1.0935 1.0951 1.0941 1.0452 1.0453 1.1038 1.1038
irintensity: 2.6618 0.7763 0.9396 0.1375 1.4584 2.5033 2.2753 9.3265 0.0063 3.6794 8.1380 24.3980 138.1572 59.0632 116.0565 14.9669 1.7715 149.6985 56.3187 57.5449 18.8425 0.2582 4.0271 2.6809 0.9441 21.2174 7.2254 1.7493 13.4640 2.5496 7.6568 34.6981 48.5582 68.2215 31.7328 27.4686 19.4407 19.3679 111.8693 0.0384 0.0191 5.2139 6.8056 21.4847 41.1388 3.6491 25.9146 15.2899 315.2895 124.4671 1.0813 8.4696 0.0162 32.3198 10.9056 2.0177 1.1495 828.1526 94.6804 11.0949 8.2821 163.7573 17.9932 222.4261 24.1186 36.1612 3.4932 0.7306 1.8311 2.9650 5.3007 145.1369 38.9906 35.3321 33.9394
temp: 298.150 k
press: 1.00000 atm
elementType: 17 17 8 7 7 6 6 6 6 6 6 6 6 6 6 6 6 1 1 1 1 1 1 1 1 1 1
symmnumber: 1
zpe: 511849.0 jmol-1
zpe.correction: 0.194953 hartree
zpe.thermalcorrener: 0.210944 hartree
zpe.thermalcorrenthalpy: 0.211888 hartree
zpe.thermalcorrgfe: 0.150095 hartree
zpe.sumelectzpe: -1566.919388 hartree
zpe.sumelectthermal: -1566.903396 hartree
zpe.sumelectthermalent: -1566.902452 hartree
zpe.sumelectthermalfe: -1566.964246 hartree
dipole: 0.0041 -0.5448 -0.0193
dipole: 0.5451
quadrupole: -70.2804 -114.4080 -113.1042
quadrupole: 0.0364 -16.6912 0.0218
quadrupole: 28.9838 -15.1438 -13.8399 0.0364 -16.6912 0.0218
hfenergy: -1567.1143407 hartree
pointgroup: C01 [X(C12H10Cl2N2O1)]
dipole: -0.0019849 0.2143368 -0.0073141 debye
polarizability: 257.9727231|0.1713289|163.4911153|20.2248573|0.0291447|107.149478 unknown
InChI: InChI=1S/C12H10Cl2N2O/c13-9-5-7(1-3-11(9)15)17-8-2-4-12(16)10(14)6-8/h1-6H,15-16H2
charge 0 multiplicity 1
27 atoms
Cl -3.096672 -2.415487 1.418007
Cl 3.085524 -2.418883 -1.412997
O  -0.0011 1.62509 0.008376
N  -5.07911 -0.872286 -0.314485
N  5.078776 -0.87203 0.304003
C  -1.228975 0.918962 -0.094795
C  1.227186 0.918934 0.103681
C  -1.485578 -0.281425 0.607902
C  1.47951 -0.283032 -0.59775
C  -2.249352 1.528615 -0.85589
C  2.252269 1.53007 0.857325
C  -3.823878 -0.277554 -0.242673
C  3.823065 -0.277447 0.238504
C  -2.763584 -0.850966 0.513889
C  2.758163 -0.852338 -0.510251
C  -3.525945 0.940557 -0.923298
C  3.529175 0.942133 0.918301
H  -0.712855 -0.754661 1.21955
H  0.703297 -0.757799 -1.203731
H  -2.031575 2.461922 -1.382757
H  2.037719 2.464465 1.383595
H  -4.312968 1.420109 -1.516494
H  4.31972 1.422988 1.505747
H  -5.26078 -1.738467 0.186005
H  -5.821503 -0.450141 -0.86252
H  5.257447 -1.739208 -0.195825
H  5.824425 -0.448724 0.846681
