program: Gaussian 09
title: 000034214
version: EM64L-G09RevD.01
frameworkgroup: C1[X(C10H12O4)]
method: RPBEPBE
basis: SDD
operation: Freq
keyword: #pfreq=noraman
keyword: PBEPBE/SDD
title: #p freq=noraman PBEPBE/SDD
converged: YES YES NO NO
title: Mulliken charges:
elementType: O O O O C C C C C C C C C C H H H H H H H H H H H H
charge: -0.199849 -0.255726 -0.206777 -0.202148 -0.510838 -0.035647 -0.327850 -0.286220 0.193815 0.216632 -0.775804 -0.325292 0.191625 -0.450906 0.243904 0.270730 0.259365 0.283830 0.215335 0.204896 0.232782 0.292358 0.254559 0.213239 0.227288 0.276701
chargesum: 0.00000
title: Mulliken charges with hydrogens summed into heavy atoms:
elementType: O O O O C C C C C C C C C C
charge: -0.199849 -0.255726 -0.206777 -0.202148 0.003796 0.223718 -0.044020 0.134010 0.193815 0.216632 0.003895 0.115235 0.191625 -0.174205
polarizability: 1.66694985e+02 5.94612781e+00 1.03251681e+02 7.28023044e+00 3.46167149e+00 8.15901966e+01
1716.lowfreq: -13.7911 -3.3921 -2.7747 0.0003 0.0004 0.0008 23.0075 32.9346 56.0348
frequency: 22.8471 32.9036 56.0323 68.8007 86.2161 111.6688 119.1316 141.2321 173.1505 204.8764 246.0419 268.1582 306.1933 317.7730 380.4967 428.2923 471.3466 519.9105 528.0830 563.4720 575.3915 636.1795 638.9431 656.7584 679.6894 754.4873 839.4061 895.5873 902.3848 911.7438 952.5217 964.2389 985.7076 1000.1465 1034.5269 1041.7194 1053.2248 1077.5006 1085.6265 1132.5445 1162.6816 1174.3987 1199.6943 1206.1312 1216.0997 1264.8160 1285.9143 1313.0590 1327.4645 1348.6711 1374.9807 1408.1161 1445.1506 1452.3908 1453.5621 1468.0223 1473.9261 1640.1922 1683.0519 2156.1975 2917.0498 2923.4998 2964.6929 2976.3418 2983.6040 3002.4427 3013.9472 3042.8150 3058.0141 3094.8812 3127.8788 3426.8788
redmass: 4.9143 5.1506 2.9031 4.4300 4.6268 5.9193 4.0260 1.1354 3.9936 4.0777 4.7564 3.1631 3.8885 3.1601 4.5449 4.0089 3.4854 3.9259 6.0724 3.7748 4.4005 1.2312 4.2070 4.6997 1.2559 3.3542 4.0703 5.0683 6.8077 1.7000 2.1006 3.6245 1.6552 1.6199 2.0934 5.5486 3.2596 3.9897 3.0808 2.1253 1.7336 1.5005 1.0852 1.4433 1.2716 1.3516 1.5163 1.2562 1.3232 1.4123 1.2636 1.5378 1.0556 1.0701 1.0913 1.0753 1.0878 8.0142 12.3458 6.0103 1.0570 1.0569 1.1026 1.0379 1.1017 1.0828 1.0637 1.0870 1.0957 1.1009 1.1000 1.1608
irintensity: 1.7422 0.3968 7.1149 4.3582 0.7433 9.2017 2.8533 0.5003 6.2684 3.3350 0.2958 4.4291 7.1471 5.1519 4.0078 1.4937 2.5116 5.8804 3.9925 16.7606 14.5465 73.6885 8.6751 2.7712 57.3274 2.0633 14.0930 47.1053 45.7610 10.3829 2.4900 2.1906 6.4108 22.9447 16.9963 300.9046 13.8602 328.1471 7.4693 15.7565 15.8797 11.2642 9.9611 49.9517 21.6188 10.6477 53.5701 1.1075 26.9928 23.4907 93.4344 5.5169 21.8133 31.2595 8.0496 3.5967 13.4438 133.2818 291.1542 1.5791 26.3202 82.4825 41.9938 6.2122 22.9670 4.4194 16.1065 19.1294 5.1272 14.3045 9.3325 60.9448
temp: 298.150 k
press: 1.00000 atm
elementType: 8 8 8 8 6 6 6 6 6 6 6 6 6 6 1 1 1 1 1 1 1 1 1 1 1 1
symmnumber: 1
zpe: 523076.3 jmol-1
zpe.correction: 0.199229 hartree
zpe.thermalcorrener: 0.214201 hartree
zpe.thermalcorrenthalpy: 0.215145 hartree
zpe.thermalcorrgfe: 0.154927 hartree
zpe.sumelectzpe: -688.006498 hartree
zpe.sumelectthermal: -687.991527 hartree
zpe.sumelectthermalent: -687.990582 hartree
zpe.sumelectthermalfe: -688.050801 hartree
dipole: 0.4387 -3.1001 2.3279
dipole: 3.9015
quadrupole: -72.5321 -92.4565 -79.2453
quadrupole: -4.7697 -10.8456 0.8172
quadrupole: 8.8792 -11.0452 2.1660 -4.7697 -10.8456 0.8172
hfenergy: -688.2057273 hartree
pointgroup: C01 [X(C10H12O4)]
dipole: -0.3146775 1.4825856 0.2430494 debye
dipolederiv: -1.5295812 0.3330747 -0.0416958 0.1163841 -0.5681293 0.0622747 -0.1898602 0.0443745 -0.2619958 -1.2256422 -0.2151422 -0.0398115 -0.2250336 -0.4551339 -0.0357301 -0.11381 -0.0338094 -0.3601894 -0.8598487 0.2506288 -0.0576345 0.38532 -0.9595529 0.1183345 -0.0547777 0.0231776 -0.3081437 -0.625763 0.0144011 0.0163914 0.0118938 -0.4514002 0.2461308 0.1869162 0.3582504 -0.7297048 -0.1575769 -0.0669656 -0.0114028 0.040019 0.0033133 0.066898 0.059121 0.0127214 0.0470158 0.4974885 -0.1171031 0.01545 -0.4489141 0.4719718 -0.0055042 0.0307939 -0.0067397 0.3208927 -0.5758366 -0.2471501 0.2038316 -0.3442859 -0.3963917 0.1440963 0.2806111 0.1301298 -0.0197423 0.7509595 0.1471129 -0.0840043 0.2272288 0.4510305 0.0014352 -0.306691 -0.0271981 0.1970385 1.890488 -0.3898542 0.1050888 0.0452837 1.3451471 -0.1987726 0.2041168 -0.0300729 0.1754916 1.2562037 0.0269114 -0.1224639 -0.0851938 0.3115982 -0.3792922 -0.3979695 -0.5139203 0.812929 -0.4425451 0.140816 -0.1392604 0.1432666 -0.131407 0.1257393 -0.1410505 0.1211356 -0.0924401 1.0525326 0.141591 0.045817 0.1018541 0.4648398 0.0178169 0.330121 0.0838114 0.4324575 -0.1179053 0.0063909 -0.0781357 -0.0144721 -0.064125 -0.011854 -0.027888 0.0018596 -0.0953006 -0.4373302 -0.0363541 0.0401105 -0.0414847 -0.3177042 -0.000332 0.0529532 0.0036988 -0.2789444 0.0676623 0.0192937 0.0103181 0.0276228 -0.0741618 -0.0673953 0.0024284 -0.0934948 0.0518541 0.1568381 -0.0171011 -0.0089876 0.0227032 0.082742 -0.002972 -0.0720065 0.0389291 -0.0387483 0.0274735 0.0229756 0.0374631 0.0895389 0.0049026 -0.0018562 0.0675793 -0.0329556 -0.0742924 0.056199 0.0172333 -0.0589549 0.0356492 0.0944993 -0.0117608 -0.0833429 -0.0069753 -0.0270115 -0.0377111 -0.0124092 0.0406224 -0.0186516 0.0070198 -0.1019259 0.1302881 -0.0424684 -0.0918711 -0.0797228 0.0283765 -0.0097379 -0.055432 -0.1965429 0.0660571 0.0479379 0.0621537 0.0481438 0.0839825 0.0212478 -0.0139705 -0.0304028 0.0820677 -0.1082551 -0.0316703 -0.0912937 -0.0268075 0.1918484 -0.0357486 -0.0145547 0.0198192 0.0433101 0.0143245 0.0246834 0.0103334 0.1373253 -0.0426678 0.0014229 0.0673001 -0.0217209 0.1220642 0.0298067 0.1211097 0.0188057 0.0161158 -0.0703161 -0.0298229 -0.0034945 0.0357999 -0.1315089 0.1292339 -0.0928612 0.0577394 0.0112728 -0.0730399 0.0082689 0.089896 -0.0041891 0.0016556 -0.1078154 -0.0426892 -0.0999858 -0.084756 0.2438107 -0.0120943 0.0118202 -0.0126029 0.2598958 0.011318 0.0159573 0.0117937 0.2394109 unknown
polarizability: 165.9216322|8.5687351|96.7275818|-7.2084326|-11.5709525|88.8876485 unknown
InChI: InChI=1S/C10H12O4/c1-3-4-13-6-8-5-9(7(2)11)10(12)14-8/h1,8-9H,4-6H2,2H3
charge 0 multiplicity 1
26 atoms
O  0.26586 -0.610242 0.476956
O  -2.624749 0.310966 0.14454
O  2.343692 -1.616035 0.68381
O  3.267685 1.704013 -1.378183
C  0.908652 1.712164 0.218309
C  -0.29476 0.786102 0.519601
C  2.144948 0.895643 0.634897
C  -1.434815 0.891269 -0.482355
C  1.658357 -0.582922 0.60954
C  3.377391 1.088742 -0.287373
C  4.675073 0.483169 0.20053
C  -3.744448 0.21217 -0.812753
C  -4.932535 -0.308402 -0.128411
C  -5.952974 -0.743502 0.406719
H  0.825153 2.668912 0.757581
H  0.987059 1.933672 -0.862294
H  -0.693101 0.92585 1.540589
H  2.463257 1.098242 1.676612
H  -1.161179 0.354039 -1.416269
H  -1.61205 1.96351 -0.727555
H  4.997515 0.97589 1.138318
H  4.512497 -0.585349 0.43923
H  5.462942 0.593032 -0.559507
H  -3.967316 1.214706 -1.242904
H  -3.462902 -0.463869 -1.649909
H  -6.835752 -1.12797 0.884781
