program: Gaussian 09
title: 000034143
version: EM64L-G09RevD.01
frameworkgroup: C1[X(C12H15NO2)]
method: RPBEPBE
basis: SDD
operation: Freq
keyword: #p
keyword: freq=noraman
keyword: PBEPBE/SDD
title: #p freq=noraman PBEPBE/SDD
converged: YES YES NO NO
title: Mulliken charges:
elementType: O O N C C C C C C C C C C C C H H H H H H H H H H H H H H H
charge: -0.263703 -0.268598 -0.572162 0.218033 0.178061 -0.523669 0.169450 0.157143 -0.395415 -0.558855 -0.333420 -0.785492 0.310936 -0.347967 -0.536319 0.229535 0.202714 0.220673 0.202221 0.248461 0.250048 0.246127 0.246388 0.234775 0.251852 0.279146 0.260742 0.244148 0.218197 0.216951
chargesum: 0.00000
title: Mulliken charges with hydrogens summed into heavy atoms:
elementType: O O N C C C C C C C C C C C C
charge: -0.263703 -0.268598 -0.032274 0.218033 0.178061 -0.091420 0.169450 0.157143 0.027479 -0.310395 -0.083372 -0.058201 0.310936 -0.096115 0.142976
polarizability: 1.95748773e+02 1.14693689e+01 1.59286569e+02 -4.92104963e+00 7.93153784e+00 8.33916552e+01
1716.lowfreq: -6.5168 -0.0007 -0.0007 0.0002 2.8557 6.1422 32.8084 61.8437 82.3249
frequency: 32.6096 61.8381 82.3056 90.8502 114.6214 117.8811 160.1849 194.7882 205.1029 209.8720 253.7687 259.9362 262.8757 342.9150 364.3765 396.6056 415.6954 433.3975 464.6610 529.7259 564.7969 586.5924 590.2411 636.8025 662.9951 707.8630 743.7586 777.6184 788.6351 809.2623 837.8073 840.0447 904.7553 937.6071 939.6807 972.6372 993.7807 1042.8974 1046.9723 1086.3849 1101.3895 1114.3725 1115.9400 1139.3275 1154.1628 1170.4331 1186.1305 1236.9835 1246.4498 1267.7984 1286.9996 1303.2219 1352.1722 1378.6508 1398.9725 1413.7532 1427.1933 1454.6849 1455.0964 1464.4454 1465.2217 1467.7904 1474.1699 1477.0574 1492.3621 1602.2643 1618.0393 1630.1998 1638.1257 2887.5264 2951.1145 2967.6866 2981.5402 3027.3823 3035.6879 3056.0702 3056.8654 3100.4398 3120.2727 3158.8134 3160.4260 3180.7616 3458.6558 3586.3798
redmass: 3.1287 3.4145 2.0570 3.1590 2.2380 1.3178 3.1821 3.2037 1.9092 1.3994 2.0944 1.9205 2.3204 3.4106 5.0370 5.6273 5.7617 3.0250 4.0634 3.8265 4.3460 1.3493 3.9643 4.0571 4.9267 5.0855 3.7065 1.6516 3.1103 1.4617 2.7817 2.1264 2.9480 1.8114 1.3634 2.1279 4.1097 1.6269 2.1344 2.5975 2.2702 1.2613 1.6354 1.7534 1.4172 2.2153 3.0019 1.5160 2.7081 1.5930 1.1313 1.4004 3.6495 1.3973 1.6466 3.4250 1.4059 1.6971 1.1797 1.0587 1.7314 1.5941 1.0931 1.1711 1.0870 7.8876 7.9856 7.4858 1.0998 1.0714 1.0334 1.0664 1.0376 1.0868 1.1036 1.0972 1.0977 1.0976 1.0987 1.0908 1.0883 1.0976 1.0449 1.0976
irintensity: 0.4562 1.7680 6.4833 1.1996 1.2874 0.2006 2.7575 2.2317 3.5997 45.6985 8.5595 4.0911 2.1669 16.5301 0.5602 3.3353 2.5023 3.5579 1.9599 0.6973 9.1040 239.6850 4.1783 9.0579 1.1883 4.8693 1.3774 3.9155 24.4903 41.3011 16.4988 28.3981 31.5977 3.9622 0.6058 1.7759 39.7018 4.1765 4.6117 7.3290 27.6392 0.1867 13.7892 24.4630 3.0032 34.5857 169.5242 5.0976 1.5632 9.2407 1.5539 5.5029 1.6870 12.5800 0.1697 29.5023 48.9333 92.3994 36.7424 12.7791 0.5913 41.2987 17.5053 8.8711 5.1034 17.8105 77.6164 4.8187 36.7975 99.3129 58.3241 32.3950 34.7514 22.8631 53.8133 33.3992 18.1326 13.7731 29.0047 11.2753 0.7396 6.6803 0.7043 0.4225
temp: 298.150 k
press: 1.00000 atm
elementType: 8 8 7 6 6 6 6 6 6 6 6 6 6 6 6 1 1 1 1 1 1 1 1 1 1 1 1 1 1 1
symmnumber: 1
zpe: 644357.6 jmol-1
zpe.correction: 0.245423 hartree
zpe.thermalcorrener: 0.260626 hartree
zpe.thermalcorrenthalpy: 0.261570 hartree
zpe.thermalcorrgfe: 0.202724 hartree
zpe.sumelectzpe: -670.334522 hartree
zpe.sumelectthermal: -670.319319 hartree
zpe.sumelectthermalent: -670.318375 hartree
zpe.sumelectthermalfe: -670.377221 hartree
dipole: -0.8236 3.0014 -0.1235
dipole: 3.1148
quadrupole: -89.4357 -76.6329 -90.5741
quadrupole: 5.4771 2.8126 -0.1242
quadrupole: -3.8882 8.9146 -5.0265 5.4771 2.8126 -0.1242
hfenergy: -670.5799452 hartree
pointgroup: C01 [X(C12H15N1O2)]
dipole: -0.4049052 1.1533653 -0.0869313 debye
polarizability: 194.0240392|13.6845528|161.4553556|-5.516668|5.1205831|82.9476029 unknown
InChI: InChI=1S/C12H15NO2/c1-8-10(5-6-13)11-7-9(14-2)3-4-12(11)15-8/h3-4,7H,5-6,13H2,1-2H3
charge 0 multiplicity 1
30 atoms
O  -0.793062 -2.377965 -0.045629
O  3.531724 1.149786 -0.025787
N  -3.272432 3.099102 -0.415958
C  -1.405532 -0.169049 0.328774
C  0.043982 -0.224781 0.154236
C  -2.22921 1.071203 0.567404
C  -1.867817 -1.471124 0.202413
C  0.376633 -1.58725 -0.070666
C  -2.450711 1.911502 -0.719412
C  1.076453 0.749526 0.179756
C  1.68754 -2.042065 -0.276302
C  -3.221991 -2.096145 0.273546
C  2.403099 0.305284 -0.02444
C  2.707041 -1.071104 -0.251486
C  3.302395 2.57434 0.206345
H  -3.223578 0.822602 0.979268
H  -1.727104 1.709686 1.324107
H  -2.996408 1.292667 -1.455664
H  -1.456742 2.143444 -1.172549
H  0.842063 1.803336 0.35509
H  1.909713 -3.098973 -0.44641
H  -3.496553 -2.572352 -0.686257
H  -3.258954 -2.880622 1.05185
H  -3.983294 -1.335007 0.510496
H  3.754374 -1.346947 -0.403457
H  -3.654023 3.577134 -1.23716
H  -2.836476 3.753991 0.241141
H  4.298788 3.038856 0.165436
H  2.848648 2.754311 1.201363
H  2.654834 3.013211 -0.578849
