program: Gaussian 09
title: 000034189
version: EM64L-G09RevD.01
frameworkgroup: C1[X(C13H22N2O3)]
method: RPBEPBE
basis: SDD
operation: Freq
keyword: #p
keyword: freq=noraman
keyword: PBEPBE/SDD
title: #p freq=noraman PBEPBE/SDD
converged: YES YES NO NO
title: Mulliken charges:
elementType: O O O N N C C C C C C C C C C C C C H H H H H H H H H H H H H H H H H H H H H H
charge: -0.230337 -0.221517 -0.239427 -0.196400 -0.188323 0.098357 -0.045580 -0.412060 -0.402536 0.168952 0.154696 -0.749559 -0.381967 -0.738749 0.204978 -0.695488 -0.604421 -0.604653 0.209223 0.240452 0.219189 0.201991 0.246955 0.220854 0.241227 0.226646 0.197621 0.198660 0.236222 0.239941 0.216918 0.215972 0.212081 0.217809 0.267403 0.251869 0.252279 0.252347 0.251783 0.266590
chargesum: 0.00000
title: Mulliken charges with hydrogens summed into heavy atoms:
elementType: O O O N N C C C C C C C C C C C C C
charge: -0.230337 -0.221517 -0.239427 -0.196400 -0.188323 0.098357 0.163644 0.047582 0.046409 0.168952 0.154696 -0.060832 0.014313 -0.045668 0.204978 -0.049626 0.167131 0.166067
polarizability: 1.74607228e+02 -5.78906267e+00 1.66205311e+02 1.32170599e+01 -2.73744245e-01 1.45048315e+02
1716.lowfreq: -17.1577 -12.7666 -0.0006 -0.0004 0.0001 4.7048 29.7408 53.6592 59.0330
frequency: 29.1261 53.5872 58.9852 66.3205 82.0277 93.9855 103.7708 112.7503 123.8595 129.8445 159.7927 174.3088 187.0332 200.2295 214.4986 230.4694 248.4414 286.8723 295.7823 302.5072 309.6291 320.3791 358.4688 375.3788 384.6859 392.4405 426.7508 448.5449 472.3632 508.3299 575.7636 646.5234 681.7959 697.1321 714.7635 716.1542 740.9554 789.8557 836.5650 854.9755 881.4209 909.9002 910.2950 934.8785 963.4266 997.6755 1006.7913 1017.1161 1053.8137 1061.1407 1065.8931 1087.4882 1097.3233 1116.4868 1130.1012 1130.3718 1165.4513 1174.2742 1193.5912 1224.3133 1238.2027 1247.9381 1278.1267 1295.1731 1302.4753 1317.5863 1325.8659 1327.5861 1340.1655 1350.1931 1355.1681 1388.8236 1390.4204 1397.5043 1420.8427 1434.1348 1448.9727 1465.7453 1468.9302 1472.8055 1473.6585 1476.0411 1478.6548 1479.8697 1481.2453 1483.5661 1485.5420 1487.2432 1490.8815 1586.5353 1590.9700 1647.2564 2959.1377 2966.8062 2974.9873 2983.4139 2989.4880 2991.6045 3012.4117 3016.7610 3017.1623 3028.3831 3047.9300 3072.3463 3074.7195 3078.8461 3081.3473 3082.1217 3093.8119 3104.1182 3109.5817 3109.8886 3145.0342 3145.8255
redmass: 3.9324 3.4189 3.0942 1.8837 2.7525 1.1545 1.1741 2.0958 2.4642 2.7724 2.4772 5.6805 2.7129 1.4295 1.3863 1.3642 2.9652 3.4167 4.0390 1.9182 2.9020 2.9366 3.9460 2.9637 6.1788 7.7536 3.6621 10.1125 3.2196 4.4207 3.9349 8.0113 4.4668 4.8578 4.9197 4.8886 1.1150 1.7932 3.1293 1.4935 1.7562 2.8219 3.0148 2.2770 1.9397 1.5701 2.3475 2.0814 2.4350 2.4827 2.2621 2.0885 2.1311 2.2863 1.3106 1.3076 2.0903 2.6195 3.4262 4.2471 1.3853 2.9965 1.2937 1.1423 1.2325 1.3420 1.3121 2.5786 1.8033 3.9650 1.4507 1.2086 1.2108 1.1910 1.1840 1.3658 1.0835 1.0627 1.0624 1.0609 1.0518 1.0431 1.0623 1.0524 1.0589 1.0892 1.0502 1.0457 1.0846 9.6470 9.2946 9.4745 1.0813 1.0589 1.0366 1.0615 1.0356 1.0364 1.0985 1.0330 1.0331 1.0606 1.1020 1.1007 1.0996 1.0999 1.0986 1.0987 1.0995 1.1029 1.1025 1.1025 1.1023 1.1022
irintensity: 0.1207 0.2513 0.2360 0.1078 0.2119 2.0053 1.8237 0.0487 7.4297 0.5270 0.5883 5.4469 0.5142 0.0837 0.4724 0.4199 3.1128 0.4962 0.9541 2.0357 4.1608 3.5649 12.0637 3.8520 21.1765 14.1050 8.5276 3.3886 10.5646 4.9679 1.6009 2.8024 2.0021 0.9283 8.6112 10.0386 7.4569 0.4288 4.0342 2.0915 6.0922 7.4631 7.3285 1.3640 28.8677 2.6373 2.0813 13.1610 52.3045 27.2778 20.9744 10.5909 38.1502 1.4610 0.0589 0.2127 6.9550 9.6363 4.4786 51.3171 2.1511 25.5980 9.4622 8.6824 14.6350 0.6867 2.4441 136.4948 74.5168 139.8732 7.8683 17.3137 10.6705 27.0901 36.2390 226.8293 21.4007 7.4089 1.5643 6.9756 31.8732 12.2684 2.5647 3.9903 15.6120 13.4306 8.9114 14.1775 18.1090 264.9357 497.6968 16.9356 8.9043 17.7623 33.4249 52.0176 29.2906 16.9762 9.4646 23.7277 24.2522 13.3253 13.0654 64.7986 43.1002 6.1513 30.5462 28.8610 33.8653 22.3752 1.6600 26.6636 0.5624 0.6030
temp: 298.150 k
press: 1.00000 atm
elementType: 8 8 8 7 7 6 6 6 6 6 6 6 6 6 6 6 6 6 1 1 1 1 1 1 1 1 1 1 1 1 1 1 1 1 1 1 1 1 1 1
symmnumber: 1
zpe: 885483.3 jmol-1
zpe.correction: 0.337263 hartree
zpe.thermalcorrener: 0.358018 hartree
zpe.thermalcorrenthalpy: 0.358962 hartree
zpe.thermalcorrgfe: 0.288032 hartree
zpe.sumelectzpe: -842.387133 hartree
zpe.sumelectthermal: -842.366378 hartree
zpe.sumelectthermalent: -842.365434 hartree
zpe.sumelectthermalfe: -842.436364 hartree
dipole: 1.1156 0.4052 -1.1825
dipole: 1.6755
quadrupole: -109.2906 -115.5470 -112.1603
quadrupole: 0.3757 -4.3775 1.6009
quadrupole: 3.0420 -3.2144 0.1724 0.3757 -4.3775 1.6009
hfenergy: -842.7243962 hartree
pointgroup: C01 [X(C13H22N2O3)]
dipole: -0.4277574 0.1645655 0.4737778 debye
polarizability: 175.316392|4.6801305|165.5608764|13.3582907|0.3772134|144.9835862 unknown
InChI: InChI=1S/C13H22N2O3/c1-6-8-9(3)13(7-2)10(16)14(4)12(18)15(5)11(13)17/h9H,6-8H2,1-5H3
charge 0 multiplicity 1
40 atoms
O  -0.584858 1.089818 -2.079658
O  1.29875 -2.50451 0.354392
O  2.767068 1.85759 1.064074
N  1.044024 1.500419 -0.469709
N  1.979872 -0.32415 0.799766
C  -0.163949 -0.700374 -0.447765
C  -1.224675 -0.422382 0.745866
C  -0.717965 -1.706365 -1.491499
C  -2.609666 0.030526 0.200375
C  0.084851 0.668252 -1.098437
C  1.093592 -1.268972 0.223913
C  -1.379262 -1.638454 1.691188
C  -3.421087 0.84902 1.234534
C  0.250371 -2.010473 -2.655625
C  1.961304 1.060502 0.513652
C  -4.811105 1.252997 0.697013
C  1.169928 2.916684 -0.892246
C  3.075604 -0.794579 1.681807
H  -0.804974 0.417989 1.340182
H  -1.653336 -1.290372 -1.901456
H  -0.959218 -2.646277 -0.965463
H  -3.196006 -0.863004 -0.093833
H  -2.489889 0.644952 -0.711833
H  -2.155935 -1.4161 2.444382
H  -0.449657 -1.883463 2.231992
H  -1.694042 -2.54181 1.139963
H  -2.849505 1.760804 1.504274
H  -3.545852 0.269567 2.17095
H  0.490335 -1.095455 -3.225536
H  1.187244 -2.467489 -2.292185
H  -0.216624 -2.724581 -3.357566
H  -4.71901 1.855782 -0.22577
H  -5.417853 0.360288 0.454913
H  -5.371351 1.851398 1.438502
H  0.420153 3.092203 -1.676491
H  2.181845 3.109145 -1.283586
H  0.997593 3.581546 -0.030769
H  3.005176 -0.297178 2.662181
H  4.055229 -0.552843 1.238454
H  2.967478 -1.88345 1.785952
