program: Gaussian 09
title: 000034180
version: EM64L-G09RevD.01
frameworkgroup: C1[X(C19H26O2)]
method: RPBEPBE
basis: SDD
operation: Freq
keyword: #pfreq=noraman
keyword: PBEPBE/SDD
title: #p freq=noraman PBEPBE/SDD
converged: YES YES NO NO
title: Mulliken charges:
elementType: O O C C C C C C C C C C C C C C C C C C C H H H H H H H H H H H H H H H H H H H H H H H H H H
charge: -0.288353 -0.461552 -0.162924 -0.236123 0.344133 -0.466084 0.159660 -0.533346 -0.395658 0.417835 0.197806 -0.776300 -0.756901 0.180419 -0.643827 -0.831593 0.610676 -0.661542 -0.539345 -0.365052 -0.686850 0.214267 0.239350 0.239778 0.205877 0.209582 0.207598 0.257996 0.226359 0.240412 0.206053 0.212782 0.250486 0.228173 0.256839 0.214894 0.230185 0.218637 0.219021 0.196082 0.203482 0.354326 0.215163 0.207718 0.208560 0.211603 0.219698
chargesum: 0.00000
title: Mulliken charges with hydrogens summed into heavy atoms:
elementType: O O C C C C C C C C C C C C C C C C C C C
charge: -0.288353 -0.107226 0.051343 0.003227 0.344133 -0.020429 0.159660 -0.116165 -0.137662 0.417835 0.197806 -0.103476 -0.065460 0.180419 -0.386989 -0.167877 0.610676 -0.442521 -0.139782 0.057829 -0.046989
polarizability: 2.67691863e+02 -4.18619116e+00 2.11735218e+02 4.29614771e-01 -8.12624459e+00 1.58387144e+02
1716.lowfreq: -5.5229 -0.0008 -0.0007 -0.0004 5.4212 8.3017 23.3435 37.7434 51.9563
frequency: 23.0419 37.6503 51.9127 75.7298 82.2828 98.9411 132.7070 159.1306 175.7102 188.7577 196.4368 217.3025 218.4097 227.0781 234.6841 239.9382 263.9001 274.2278 290.8709 309.2845 313.1753 325.6627 340.5466 352.1836 377.5282 428.0104 434.2819 457.7301 477.6731 497.7708 514.0347 527.7430 560.0062 590.8146 605.0033 633.9898 661.3401 677.1224 708.7332 743.5464 758.8511 780.7703 802.5451 814.9816 821.6333 860.1460 867.8269 883.7440 889.2377 894.5050 924.7071 930.5601 949.9387 962.9688 984.2345 997.0959 997.9331 1017.6338 1033.8644 1050.5983 1056.9401 1074.2600 1080.0520 1093.6774 1116.8573 1130.4188 1139.5001 1155.3745 1173.9566 1178.0602 1190.2890 1210.7551 1220.2255 1231.2143 1234.1349 1244.5585 1261.8029 1272.5030 1280.9203 1289.9229 1296.0467 1310.2002 1319.9989 1323.9394 1337.3852 1350.7027 1374.5583 1380.5141 1388.0221 1389.0606 1392.2039 1395.8530 1413.3878 1451.3334 1455.1066 1462.4098 1467.0544 1469.5222 1471.0820 1471.4720 1474.2873 1476.4134 1477.0095 1488.9815 1494.1762 1500.0942 1582.3675 1625.6198 1696.6990 2931.1030 2941.4426 2954.6338 2970.7390 2973.7044 2979.5194 2984.1071 2988.8264 2989.2990 2996.4264 3008.4889 3017.7083 3023.6991 3042.7139 3062.9274 3070.4058 3072.4334 3076.7805 3082.5794 3090.4430 3097.5867 3098.2164 3108.9288 3149.7862 3150.5720 3578.0705
redmass: 2.8270 4.1191 3.4431 1.7592 3.7407 3.1981 3.0357 1.6058 1.2449 1.9066 1.9825 1.3312 2.3180 1.4833 1.5595 3.4475 3.3161 3.7447 2.8107 3.7896 2.7656 1.5971 2.5670 2.2215 3.1989 3.1344 2.4063 3.2610 3.3689 3.6247 4.3662 3.8342 4.6953 4.5567 4.3110 5.9471 4.0976 3.2027 2.8778 1.1041 3.1006 2.5297 3.7139 1.7965 1.9124 1.5178 1.3546 2.2065 1.8750 1.7261 1.8836 1.6639 1.7686 2.1929 4.4686 1.4478 3.5104 1.6254 1.5691 2.7486 1.9750 1.9965 1.4154 2.1632 2.2385 1.9655 2.0780 1.7808 1.7703 1.4405 1.8835 1.8065 1.3974 1.8688 1.6784 1.5402 1.7884 1.3716 1.1440 1.6203 1.4490 2.1504 1.4481 1.9401 1.6794 1.6024 1.6739 1.3972 1.2242 5.0801 1.2491 1.2294 3.4938 1.0571 1.0797 1.0505 1.0847 1.0791 1.0633 1.0663 1.0535 1.0489 1.0560 1.0894 1.0906 3.2288 7.1232 7.5639 6.8651 1.0813 1.0625 1.0383 1.0401 1.0548 1.0813 1.0604 1.0543 1.0700 1.0373 1.0672 1.0994 1.0965 1.1031 1.1023 1.1016 1.0992 1.0978 1.0991 1.0987 1.0910 1.0993 1.0985 1.0917 1.0906 1.0658
irintensity: 0.0294 0.4097 1.2365 0.0082 0.0900 0.5807 1.6944 0.4551 0.5529 1.1909 0.8717 0.0734 0.3001 0.1613 0.3532 2.4563 2.0529 2.5933 0.9222 2.0591 0.1749 80.2056 4.8042 20.4340 8.6189 0.4679 5.4563 3.2833 1.0266 1.6806 1.0469 0.6902 5.9819 0.2481 5.5090 5.4174 9.9506 4.2278 10.3698 2.9955 2.0014 6.1238 14.4699 22.9157 5.5741 19.2986 12.4932 11.6748 5.2144 10.3943 1.2043 1.4199 10.3724 9.9373 43.9046 13.5016 118.8111 6.4081 18.3169 2.8995 6.2709 8.3384 17.0360 24.6094 3.0604 75.2510 20.9359 43.1761 1.3922 38.0872 18.5674 12.9230 6.7317 22.5603 83.8054 6.9786 13.9149 7.0794 0.7926 9.1372 18.0161 14.8520 6.5758 16.6307 3.5172 3.6598 22.3952 24.9954 12.3069 3.8767 6.9187 30.8982 70.8759 5.3589 9.1796 9.9887 3.0166 0.4139 2.1879 21.1277 1.7187 5.8344 4.4086 16.5385 13.8708 29.3090 99.2439 103.2751 2.6126 18.9610 41.9666 79.1437 24.3934 41.3506 23.0260 54.5303 34.6707 3.9820 31.3124 39.8289 1.2608 31.5529 9.7124 47.9321 76.8710 47.9383 28.3547 5.0864 42.2514 22.1858 22.9042 24.9807 6.7602 14.7343 25.3426
temp: 298.150 k
press: 1.00000 atm
elementType: 8 8 6 6 6 6 6 6 6 6 6 6 6 6 6 6 6 6 6 6 6 1 1 1 1 1 1 1 1 1 1 1 1 1 1 1 1 1 1 1 1 1 1 1 1 1 1
symmnumber: 1
zpe: 1057264.0 jmol-1
zpe.correction: 0.402691 hartree
zpe.thermalcorrener: 0.424119 hartree
zpe.thermalcorrenthalpy: 0.425063 hartree
zpe.thermalcorrgfe: 0.353206 hartree
zpe.sumelectzpe: -888.472415 hartree
zpe.sumelectthermal: -888.450987 hartree
zpe.sumelectthermalent: -888.450043 hartree
zpe.sumelectthermalfe: -888.521900 hartree
dipole: 0.1028 -0.6284 0.7914
dipole: 1.0158
quadrupole: -116.4662 -118.9324 -127.8236
quadrupole: -7.7691 1.5621 -0.3085
quadrupole: 4.6079 2.1417 -6.7495 -7.7691 1.5621 -0.3085
hfenergy: -888.8751058 hartree
pointgroup: C01 [X(C19H26O2)]
dipole: -0.0382396 -0.2424263 -0.315403 debye
polarizability: 267.6591644|4.3076051|211.4929353|0.9792197|8.9812013|158.6621252 unknown
InChI: InChI=1S/C19H26O2/c1-5-6-13-10-16(20)18-14-9-12(2)7-8-15(14)19(3,4)21-17(18)11-13/h9-11,14-15,20H,5-8H2,1-4H3
charge 0 multiplicity 1
47 atoms
O  0.104919 1.995742 0.473239
O  -0.236854 -2.447079 -1.53671
C  2.254092 0.996696 -0.252411
C  1.543388 -0.249887 -0.869204
C  1.341243 2.253051 -0.350604
C  2.709178 0.693176 1.197171
C  0.059603 -0.301331 -0.458019
C  3.741927 -0.451102 1.223451
C  2.308018 -1.532964 -0.538626
C  3.313961 -1.634527 0.371175
C  -0.560064 0.783372 0.222892
C  1.946144 3.511652 0.290345
C  0.907331 2.552454 -1.803956
C  -0.782026 -1.408994 -0.743911
C  -1.891746 0.719184 0.697856
C  4.067981 -2.932117 0.591366
C  -2.679877 -0.425446 0.461795
C  -2.115719 -1.488571 -0.286881
C  -4.125833 -0.489841 0.931387
C  -5.133255 0.006343 -0.144438
C  -6.595187 -0.052194 0.346656
H  3.160054 1.197229 -0.861331
H  1.573617 -0.156145 -1.97689
H  1.826907 0.415352 1.803957
H  3.152166 1.592477 1.660939
H  3.904425 -0.787489 2.268207
H  4.730516 -0.083036 0.871119
H  2.005594 -2.414993 -1.112219
H  1.274851 4.373435 0.13276
H  2.07895 3.384075 1.376282
H  2.926377 3.74287 -0.1647
H  1.795154 2.737243 -2.436775
H  0.335997 1.718832 -2.24461
H  0.268558 3.452318 -1.826454
H  -2.293947 1.583392 1.236269
H  5.157204 -2.792525 0.437172
H  3.725089 -3.726834 -0.093722
H  3.941067 -3.295325 1.631218
H  -2.721595 -2.377053 -0.514504
H  -4.390324 -1.52985 1.209075
H  -4.252454 0.126074 1.843005
H  -0.913487 -3.15584 -1.672775
H  -4.871206 1.043815 -0.429848
H  -5.016908 -0.6068 -1.059807
H  -6.883703 -1.085849 0.61693
H  -6.738072 0.58023 1.243309
H  -7.295755 0.302078 -0.431581
