program: Gaussian 09
title: 000034074
version: EM64L-G09RevD.01
frameworkgroup: C1[X(C13H22NO)]
method: RPBEPBE
basis: SDD
operation: Freq
keyword: #p
keyword: freq=noraman
keyword: PBEPBE/SDD
title: #p freq=noraman PBEPBE/SDD
converged: YES YES NO NO
title: Mulliken charges:
elementType: O N C C C C C C C C C C C C C H H H H H H H H H H H H H H H H H H H H H H
charge: -0.311147 -0.109690 -0.342860 -0.432121 -0.544328 -0.556701 -0.554491 -0.527652 0.384590 0.183902 -0.408151 -0.362185 -0.243958 -0.227300 -0.536913 0.268280 0.264273 0.274194 0.240105 0.268580 0.263852 0.268759 0.278708 0.259854 0.268772 0.277778 0.269300 0.258673 0.230393 0.217437 0.238457 0.248670 0.242330 0.241758 0.228226 0.238556 0.242049
chargesum: 1.00000
title: Mulliken charges with hydrogens summed into heavy atoms:
elementType: O N C C C C C C C C C C C C C
charge: -0.311147 -0.109690 0.189693 0.082177 0.256863 0.250633 0.251260 -0.079821 0.384590 0.183902 -0.169694 -0.113516 -0.001627 0.014458 0.171918
polarizability: 1.79939331e+02 -8.09325365e+00 1.55340806e+02 1.58215844e+01 1.98934309e+00 1.04314463e+02
1716.lowfreq: -17.9414 -4.1113 0.0002 0.0006 0.0007 5.4399 12.6664 31.1029 53.4695
frequency: 5.8264 30.6573 53.3051 75.4803 101.2923 115.7918 149.2726 170.6912 184.8705 225.9716 230.9044 248.2343 252.7457 269.4091 302.7955 319.5349 339.9232 377.5267 428.2035 436.0901 455.0101 476.9360 506.3902 530.4585 556.6368 598.5312 714.5843 735.5327 743.0467 762.8065 766.5033 823.9262 848.8406 862.0041 870.6804 931.9953 937.8128 943.4347 982.2796 986.1832 1015.4313 1036.5552 1042.7847 1053.5159 1059.3170 1091.3290 1113.9341 1114.6157 1128.8049 1151.3400 1166.9698 1177.1534 1195.5526 1216.5879 1228.9649 1242.6484 1245.8122 1271.3111 1291.2462 1307.7595 1319.2421 1340.1630 1363.1709 1389.1630 1420.7327 1422.2372 1434.4073 1445.2610 1447.3710 1449.7163 1457.2929 1461.2573 1465.6625 1467.8218 1469.7080 1473.6611 1480.6832 1483.0985 1485.6193 1490.4675 1500.1044 1598.2168 1610.1431 2973.3074 2983.2846 3003.5597 3011.8852 3023.4239 3027.0436 3030.8286 3041.7526 3067.7753 3068.0447 3093.9883 3123.9567 3126.2400 3139.1728 3140.0275 3144.3321 3145.2972 3145.8259 3153.9878 3158.2797 3164.0676 3176.9288
redmass: 2.8177 3.4936 3.5954 1.7517 2.7630 2.4323 3.3052 1.4689 2.1815 1.9868 1.8907 1.0878 1.1302 2.2122 2.7660 3.0346 2.2439 2.8006 2.2699 2.7429 3.1826 3.7144 2.9425 4.1666 4.0378 5.1677 4.6076 3.7834 2.9140 1.3747 1.1914 3.6169 1.5022 1.5422 3.1607 2.4627 2.6917 1.4260 8.8319 1.3293 3.9781 1.8448 1.2024 1.8742 2.1437 1.4354 1.3916 1.4315 1.6349 1.4766 1.2660 1.1554 1.8899 1.7008 2.7701 1.6775 1.8642 1.3596 1.3631 1.1865 1.2525 1.3653 1.3031 6.3604 1.1452 1.1443 1.4504 1.1151 1.4937 1.0478 1.1157 1.1743 1.0404 1.0493 1.0634 1.1842 1.0843 1.0549 1.0772 1.9203 1.0614 6.8546 6.6670 1.0322 1.0588 1.0593 1.0577 1.0323 1.0322 1.0337 1.1013 1.1046 1.1054 1.1069 1.0895 1.1010 1.1054 1.1056 1.1050 1.0881 1.1051 1.1051 1.1046 1.0931 1.0998
irintensity: 0.0546 0.8998 1.7076 0.9149 4.5528 1.9244 4.8299 0.7327 2.1977 2.1823 1.5441 0.7007 0.8572 0.0503 0.8902 0.3111 0.2319 0.5591 0.1183 1.1347 3.8357 3.0319 7.3371 7.4567 2.5064 1.8342 4.9234 1.2118 5.1411 76.8985 29.4952 11.5895 3.5440 4.2951 40.2968 11.4624 14.9439 4.7097 47.5109 0.0474 7.9722 7.2400 0.0806 11.8864 1.5985 13.3823 2.3845 2.1417 32.4626 2.2155 8.2019 9.9014 26.1334 4.7569 66.1306 4.7431 0.5534 14.1219 8.6308 3.1783 1.4529 19.2587 4.5048 7.8941 16.0821 19.3104 16.7252 1.1842 7.4779 0.6450 5.1630 9.6123 2.4956 16.5871 2.8574 69.0706 7.3597 39.6379 63.3072 26.3060 84.4562 9.6228 17.0322 53.7346 22.0071 8.9067 24.5340 5.1477 4.1470 3.7999 8.9114 30.2754 3.9462 18.2732 10.5035 20.8830 0.4709 0.2266 4.0754 3.6148 12.3265 1.1848 5.8266 15.2747 9.6539
temp: 298.150 k
press: 1.00000 atm
elementType: 8 7 6 6 6 6 6 6 6 6 6 6 6 6 6 1 1 1 1 1 1 1 1 1 1 1 1 1 1 1 1 1 1 1 1 1 1
symmnumber: 1
zpe: 860844.5 jmol-1
zpe.correction: 0.327878 hartree
zpe.thermalcorrener: 0.344737 hartree
zpe.thermalcorrenthalpy: 0.345681 hartree
zpe.thermalcorrgfe: 0.281322 hartree
zpe.sumelectzpe: -637.120141 hartree
zpe.sumelectthermal: -637.103283 hartree
zpe.sumelectthermalent: -637.102339 hartree
zpe.sumelectthermalfe: -637.166698 hartree
dipole: -12.5088 0.9736 1.0790
dipole: 12.5929
quadrupole: -18.8922 -71.6870 -86.6070
quadrupole: 5.0291 0.7192 1.0126
quadrupole: 40.1699 -12.6250 -27.5449 5.0291 0.7192 1.0126
hfenergy: -637.4480198 hartree
pointgroup: C01 [X(C13H22N1O1)]
dipole: -4.8914931 0.3572323 0.7015673 debye
polarizability: 180.439184|-11.7982885|151.588286|10.6889047|14.4065609|107.5671305 unknown
InChI: InChI=1S/C13H22NO/c1-14(2,3)11-7-9-12-8-5-6-10-13(12)15-4/h5-6,8,10H,7,9,11H2,1-4H3
charge 1 multiplicity 1
37 atoms
O  1.221564 1.67456 -0.058831
N  -3.657657 -0.023533 0.194359
C  -2.48297 -0.184533 -0.816872
C  -1.092067 -0.379026 -0.202105
C  -4.949907 0.152173 -0.603285
C  -3.781954 -1.263596 1.075942
C  -3.444196 1.207866 1.071453
C  -0.030711 -0.46678 -1.342425
C  1.378562 -0.602884 -0.791187
C  2.007175 0.502359 -0.146035
C  2.104662 -1.809179 -0.907139
C  3.324055 0.399117 0.357092
C  3.420897 -1.929506 -0.403458
C  4.025796 -0.821334 0.225858
C  1.875599 2.891861 0.443197
H  -2.50303 0.728382 -1.439868
H  -2.757126 -1.045418 -1.454042
H  -0.805607 0.474242 0.436562
H  -1.036809 -1.306268 0.39659
H  -5.106373 -0.735318 -1.235166
H  -5.794794 0.267845 0.09293
H  -4.862723 1.048443 -1.236038
H  -2.880913 -1.363184 1.696592
H  -4.66787 -1.155788 1.720768
H  -3.89249 -2.150736 0.433635
H  -2.549764 1.064267 1.692701
H  -3.309836 2.088457 0.424885
H  -4.327612 1.344435 1.714153
H  -0.099839 0.452483 -1.956583
H  -0.256949 -1.329242 -1.997683
H  1.637473 -2.662581 -1.413744
H  3.810839 1.248996 0.843767
H  3.967819 -2.871093 -0.510818
H  5.046733 -0.898107 0.614286
H  2.172861 2.780208 1.503102
H  1.121051 3.687027 0.350799
H  2.761108 3.147084 -0.16769
