program: Gaussian 09
title: 000034176
version: EM64L-G09RevD.01
frameworkgroup: C1[X(C17H19NO)]
method: RPBEPBE
basis: SDD
operation: Freq
keyword: #p
keyword: freq=noraman
keyword: PBEPBE/SDD
title: #p freq=noraman PBEPBE/SDD
converged: YES YES NO NO
title: Mulliken charges:
elementType: O N C C C C C C C C C C C C C C C C C H H H H H H H H H H H H H H H H H H H
charge: -0.294219 -0.078371 -0.116888 -0.300861 0.240983 0.222703 -0.384959 0.513459 -0.416355 -0.395399 -0.237239 -0.225206 -0.459580 -0.366059 -0.622919 -0.617499 -0.225696 -0.224336 -0.242311 0.225866 0.229589 0.184342 0.228441 0.239969 0.247685 0.226806 0.227588 0.229638 0.239063 0.184605 0.228332 0.224201 0.235506 0.221421 0.182978 0.224755 0.223009 0.226960
chargesum: 0.00000
title: Mulliken charges with hydrogens summed into heavy atoms:
elementType: O N C C C C C C C C C C C C C C C C C
charge: -0.294219 -0.078371 0.108978 -0.071273 0.240983 0.222703 0.027824 0.513459 -0.176385 -0.147715 -0.010434 0.002382 -0.229942 -0.126996 0.014219 0.022405 -0.000940 -0.001327 -0.015352
polarizability: 2.34363924e+02 -8.47056953e+00 1.86022913e+02 -7.25442849e+00 -1.88196926e+00 1.40059418e+02
1716.lowfreq: -11.7181 -8.7244 0.0004 0.0007 0.0008 7.7768 11.4674 19.0442 22.9213
frequency: -10.1467 18.4315 22.7398 54.6314 61.0879 80.6319 147.4961 186.3048 202.1260 213.6026 220.2388 233.9078 269.4636 277.8100 328.4818 379.1192 398.2826 403.1599 418.6528 445.4355 454.4339 513.5711 523.6752 551.8602 598.5329 615.0938 634.2205 682.0775 701.8995 724.4011 747.6747 758.5108 798.5939 814.5299 827.3856 851.3673 864.6146 875.8716 888.1660 923.2424 940.9031 949.7723 974.7253 986.9708 990.3290 993.4881 994.9298 1023.8343 1025.3853 1027.8010 1036.6531 1068.2060 1080.5396 1089.1060 1104.6813 1131.5344 1166.8575 1170.6864 1171.0416 1175.0323 1183.0074 1197.2601 1215.7062 1221.8146 1248.7223 1266.8298 1276.8306 1288.0473 1300.2000 1309.7712 1337.9400 1366.8289 1387.5242 1392.5520 1418.0581 1432.4079 1440.0225 1444.0144 1455.1211 1461.1312 1467.1482 1470.7770 1476.5540 1482.8894 1484.1353 1595.4425 1598.3573 1612.8938 1617.7138 2825.3044 2833.5555 2853.7960 2925.9931 2947.1701 3019.9520 3021.4400 3044.9664 3077.0427 3082.0928 3113.0164 3123.2740 3125.0594 3131.7772 3138.0008 3144.4846 3151.0769 3162.7376 3163.9278
redmass: 3.5187 2.8311 4.5223 3.7128 4.1307 3.8783 3.6992 3.7838 4.1092 4.1382 1.3731 1.0981 3.4231 2.6889 4.6427 1.8921 3.2991 2.8217 2.6974 2.8333 3.5262 5.3942 3.6807 3.8574 6.0720 6.3385 4.7197 5.8359 1.7718 4.4338 1.5168 1.8220 3.2939 4.4194 2.8742 1.2531 1.9236 3.0952 2.5647 1.6954 3.8575 1.4806 1.3918 1.3231 5.9517 1.6226 2.0017 2.2732 2.1910 2.3203 1.5371 2.6593 1.5930 1.3039 2.0547 1.3860 1.8273 1.1739 1.0615 1.6786 1.1241 1.6117 1.5442 1.4603 1.8972 2.3133 1.6441 1.6511 1.7337 1.3351 1.3668 1.4325 6.7313 6.9670 1.1391 1.1149 2.1647 2.3454 1.1491 1.0463 2.6852 1.0706 1.0596 2.3339 1.0612 6.1334 7.2723 6.2947 6.9055 1.0687 1.0579 1.0592 1.0829 1.0828 1.0709 1.0710 1.0877 1.1007 1.1006 1.0873 1.0857 1.0863 1.0892 1.0916 1.0946 1.0954 1.1004 1.1011
irintensity: 0.4286 0.3659 0.5558 1.5300 0.1032 0.5396 0.4960 2.8835 0.2582 2.3964 0.9498 0.2376 1.8807 2.6807 1.5332 3.8803 1.6053 0.5396 2.1142 1.3264 6.9041 3.3476 10.0898 9.1890 8.7053 1.6222 3.9271 9.3676 48.1111 4.6771 74.8708 61.3538 4.6061 21.2034 0.8530 0.2589 0.9112 6.1529 1.1429 10.5726 62.5320 3.3254 0.2294 0.0332 2.9485 17.8278 32.8063 17.1562 3.9868 41.1503 19.2335 16.1171 7.4873 8.3227 2.7438 12.3419 2.9991 5.1246 0.3254 9.5121 2.5207 0.5336 4.5109 3.2873 6.0595 16.8982 2.4830 9.8744 4.2990 11.5966 2.7304 6.6768 1.1075 1.4820 2.8620 3.3899 7.7120 19.4774 8.0902 16.4401 14.9133 16.3546 18.2320 11.4800 11.1040 0.4226 0.0694 7.4550 2.2014 77.5358 86.2888 240.9943 40.2478 48.2685 32.4612 52.1180 17.4381 26.5617 57.9291 8.3895 3.8882 0.2127 5.7383 21.7815 26.8249 39.2076 30.4718 19.8167
temp: 298.150 k
press: 1.00000 atm
elementType: 8 7 6 6 6 6 6 6 6 6 6 6 6 6 6 6 6 6 6 1 1 1 1 1 1 1 1 1 1 1 1 1 1 1 1 1 1 1
symmnumber: 1
zpe: 826309.6 jmol-1
zpe.correction: 0.314725 hartree
zpe.thermalcorrener: 0.331160 hartree
zpe.thermalcorrenthalpy: 0.332105 hartree
zpe.thermalcorrgfe: 0.268813 hartree
zpe.sumelectzpe: -787.773411 hartree
zpe.sumelectthermal: -787.756975 hartree
zpe.sumelectthermalent: -787.756031 hartree
zpe.sumelectthermalfe: -787.819323 hartree
dipole: -0.7099 1.7865 1.0806
dipole: 2.2053
quadrupole: -95.5784 -110.6383 -110.9194
quadrupole: -0.4649 -3.2739 -4.6400
quadrupole: 10.1336 -4.9263 -5.2074 -0.4649 -3.2739 -4.6400
hfenergy: -788.0881353 hartree
pointgroup: C01 [X(C17H19N1O1)]
dipole: -0.3510409 -0.6820558 -0.4053849 debye
polarizability: 235.7920888|4.19938|184.8494533|4.1512633|-3.2503095|139.8047127 unknown
InChI: InChI=1S/C17H19NO/c1-18(2)12-16-14-10-6-7-11-15(14)17(19-16)13-8-4-3-5-9-13/h3-11,16-17H,12H2,1-2H3
charge 0 multiplicity 1
38 atoms
O  -0.426111 0.882424 0.898805
N  -3.281336 2.015481 0.167902
C  -1.684211 0.121221 0.62647
C  0.71664 -0.0677 1.025685
C  -1.197904 -1.246323 0.174721
C  0.193951 -1.354786 0.391468
C  -2.523393 0.890286 -0.414099
C  1.963504 0.518194 0.379856
C  -1.922738 -2.324084 -0.371558
C  0.890559 -2.532207 0.062486
C  -1.229444 -3.513674 -0.704818
C  0.167008 -3.616414 -0.49179
C  3.218029 0.393841 1.023771
C  1.895652 1.157731 -0.882458
C  -4.503983 1.586697 0.869629
C  -3.533055 3.107586 -0.790225
C  4.393346 0.886963 0.411337
C  3.065663 1.657532 -1.492694
C  4.319946 1.519398 -0.850288
H  -2.250709 0.042851 1.579254
H  0.920144 -0.237824 2.106411
H  -3.199601 0.164448 -0.939264
H  -1.819466 1.283595 -1.169459
H  -3.003723 -2.251236 -0.537595
H  1.972778 -2.604082 0.218612
H  -1.776751 -4.360106 -1.13464
H  0.690784 -4.540426 -0.760991
H  3.2753 -0.081223 2.011648
H  0.919867 1.277368 -1.36499
H  -5.265344 1.12352 0.188115
H  -4.971696 2.455446 1.365935
H  -4.259708 0.84798 1.65356
H  -2.574199 3.46627 -1.203508
H  -4.013751 3.953737 -0.266532
H  -4.195747 2.815404 -1.645762
H  5.358771 0.787091 0.920181
H  3.003295 2.157019 -2.466343
H  5.227834 1.908504 -1.325032
