program: Gaussian 09
title: 000034036
version: EM64L-G09RevD.01
frameworkgroup: C1[X(C6H6F3NO2)]
method: RPBEPBE
basis: SDD
operation: Freq
keyword: #p
keyword: freq=noraman
keyword: PBEPBE/SDD
title: #p freq=noraman PBEPBE/SDD
converged: YES YES NO NO
title: Mulliken charges:
elementType: F F F O O N C C C C C C H H H H H H
charge: -0.130777 -0.143763 -0.150063 -0.280792 -0.214051 0.041987 0.208515 0.369279 -0.695182 -0.146826 0.316115 -0.743190 0.282236 0.257172 0.255178 0.263371 0.257179 0.253612
chargesum: 0.00000
title: Mulliken charges with hydrogens summed into heavy atoms:
elementType: F F F O O N C C C C C C
charge: -0.130777 -0.143763 -0.150063 -0.280792 -0.214051 0.041987 0.208515 0.369279 0.099404 -0.146826 0.316115 0.030971
polarizability: 7.99473991e+01 -5.12968123e+00 8.09267367e+01 -2.43625971e+00 -3.00346506e+00 6.51982001e+01
1716.lowfreq: -7.0570 -0.0003 0.0007 0.0009 3.5833 15.1033 52.7478 60.6891 80.8731
frequency: 52.7184 60.6837 80.8672 95.0569 111.8685 134.0650 189.3839 216.7492 231.9562 251.7998 290.1019 318.0628 374.1505 393.6244 424.6739 488.0993 496.2819 540.9153 557.2723 589.6422 649.3761 700.5670 781.0256 888.2879 908.9551 985.3637 1041.4409 1043.1430 1053.9511 1067.8662 1090.8926 1160.8274 1186.3614 1233.5303 1386.4591 1393.0526 1450.9982 1451.3754 1464.4036 1478.2530 1680.3220 2206.6930 3011.6875 3019.0744 3099.9321 3120.4235 3146.5656 3148.4979
redmass: 1.6741 3.7528 5.1371 3.4260 4.9881 12.3823 4.1525 6.6125 1.1721 4.7666 7.8872 3.9252 5.7304 6.6941 7.4415 14.4171 11.1695 5.2871 3.6985 6.1847 10.4594 6.7609 4.6213 2.9404 3.4789 2.0610 9.8567 1.7062 7.0941 3.6418 3.0288 3.6921 3.2458 4.4905 1.2298 1.1810 1.0483 1.0543 1.0546 1.0459 9.9840 12.6606 1.0368 1.0355 1.0973 1.1009 1.1013 1.1013
irintensity: 2.8026 0.7332 1.6323 0.7445 4.9746 1.2061 4.9598 3.5291 0.0764 1.2422 2.1149 0.6442 6.9287 2.3382 6.6954 3.7492 3.2309 14.3974 5.5772 12.4584 6.9766 8.2607 3.2774 55.1511 50.5431 66.6215 202.1559 8.3886 265.0715 101.8109 174.7765 98.2201 122.9064 37.7571 52.2307 30.2018 22.7091 28.7972 22.1272 12.8258 147.5419 1.8380 0.1543 2.4923 2.8876 4.4173 0.5097 5.4180
temp: 298.150 k
press: 1.00000 atm
elementType: 9 9 9 8 8 7 6 6 6 6 6 6 1 1 1 1 1 1
symmnumber: 1
zpe: 303536.3 jmol-1
zpe.correction: 0.115611 hartree
zpe.thermalcorrener: 0.128586 hartree
zpe.thermalcorrenthalpy: 0.129531 hartree
zpe.thermalcorrgfe: 0.075740 hartree
zpe.sumelectzpe: -736.027545 hartree
zpe.sumelectthermal: -736.014569 hartree
zpe.sumelectthermalent: -736.013625 hartree
zpe.sumelectthermalfe: -736.067416 hartree
dipole: 1.9935 -2.9951 2.0695
dipole: 4.1506
quadrupole: -66.9357 -76.9516 -65.7836
quadrupole: -8.4529 -4.3615 3.9326
quadrupole: 2.9546 -7.0613 4.1067 -8.4529 -4.3615 3.9326
hfenergy: -736.1431556 hartree
pointgroup: C01 [X(C6H6F3N1O2)]
dipole: 0.7597436 1.3145235 -0.6011315 debye
dipolederiv: -0.3726415 0.0583952 0.1107569 0.0478952 -0.283679 -0.0624445 0.0456118 -0.0340214 -0.8030806 -0.3701658 0.1536183 -0.0163962 0.0539654 -0.7547309 0.1939419 0.0298723 0.1281341 -0.3552941 -0.733812 -0.1974579 -0.1367425 -0.1284645 -0.4227406 -0.0954484 -0.0741567 -0.0963432 -0.3451684 -1.5648787 -0.1267316 -0.1174056 0.069509 -0.4442787 -0.0385734 -0.0682008 -0.0664444 -0.3946197 -0.7443844 -0.0522431 -0.0301295 0.2776451 -0.6387805 -0.2221245 0.1515026 -0.2253505 -0.4359531 -0.1809881 -0.0251796 -0.0010157 -0.0546245 -0.0928138 -0.0185352 0.0332357 -0.0247695 -0.1551285 0.5803378 0.1499808 0.1236955 0.2915596 0.478873 -0.0815183 0.1874228 -0.0110884 0.4443133 1.5534184 -0.0800831 -0.0022677 -0.0424409 1.4094503 -0.0137926 -0.014514 0.0208304 1.4417234 -0.1313413 0.0061107 0.0218751 -0.0237513 -0.0886647 0.0134814 -0.0416959 -0.0381965 -0.1166237 -0.0567755 0.0694029 -0.0375513 -0.0300735 -0.1589742 0.0124228 -0.0558696 0.0256056 -0.1111008 1.8708894 0.1801128 0.1535567 -0.3393946 0.8418755 0.3852412 -0.0873132 0.4109361 0.4816791 -0.1552287 -0.123152 -0.0789743 -0.1588354 -0.2090927 -0.1543889 -0.1187483 -0.1629865 -0.0950974 0.0358058 0.0607513 0.0637118 0.0611834 0.0988804 -0.0068362 0.0388662 -0.0009204 0.106604 0.006047 -0.0829049 -0.0593225 -0.0784067 0.0861081 -0.0128606 -0.0630329 -0.0165148 0.0876477 0.1398616 -0.0016931 0.0002889 -0.000385 -0.0428924 0.0539782 0.0024532 0.0440702 0.0566572 0.088232 -0.0319239 0.0576947 -0.0109671 0.1345529 0.0176252 0.0349871 -0.0073014 -0.0221899 0.0985692 0.0346064 -0.0517263 0.0215513 0.0007071 0.0566076 -0.0190206 0.0844999 0.0990853 -0.0629449 0.0083906 -0.000048 0.0440347 0.0862002 -0.0267757 0.0186003 -0.0301393 0.1165464 unknown
polarizability: 79.4045122|4.6468888|81.7850062|3.6825267|-0.2400637|64.8828176 unknown
InChI: InChI=1S/C6H6F3NO2/c1-4(11)12-5(2,3-10)6(7,8)9/h1-2H3
charge 0 multiplicity 1
18 atoms
F  -1.627972 0.555218 1.525866
F  -1.694204 1.806279 -0.361619
F  -2.672872 -0.238242 -0.323982
O  0.801988 0.727614 0.217174
O  2.532018 -0.656298 -0.548026
N  -0.108917 -2.647397 0.5949
C  -0.234246 -0.161723 -0.380704
C  -1.555644 0.497394 0.128822
C  -0.189299 -0.153746 -1.923656
C  -0.146145 -1.536127 0.168251
C  2.171379 0.360276 0.069892
C  3.032608 1.380289 0.770159
H  0.730379 -0.648423 -2.266325
H  -1.060564 -0.693066 -2.331135
H  -0.209355 0.888189 -2.28256
H  2.775652 1.419295 1.842672
H  2.849558 2.385683 0.353518
H  4.091337 1.111288 0.649353
