program: Gaussian 09
title: 000034034
version: EM64L-G09RevD.01
frameworkgroup: C1[X(C11H11Cl2NO2)]
method: RPBEPBE
basis: SDD
operation: Freq
keyword: #p
keyword: freq=noraman
keyword: PBEPBE/SDD
title: #p freq=noraman PBEPBE/SDD
converged: YES YES NO NO
title: Mulliken charges:
elementType: Cl Cl O O N C C C C C C C C C C C H H H H H H H H H H H
charge: -0.011001 -0.042320 -0.266567 -0.451885 0.006002 -0.058646 -0.328856 -0.526448 0.271490 0.339598 0.041266 -0.363781 -0.278079 -0.757679 -0.112519 -0.239939 0.230436 0.234408 0.240285 0.234547 0.208484 0.270351 0.245617 0.225188 0.256657 0.284066 0.349326
chargesum: 0.00000
title: Mulliken charges with hydrogens summed into heavy atoms:
elementType: Cl Cl O O N C C C C C C C C C C C
charge: -0.011001 -0.042320 -0.266567 -0.102559 0.006002 0.171791 0.145837 -0.083417 0.271490 0.339598 0.041266 -0.093430 -0.278079 -0.030217 -0.112519 0.044127
polarizability: 2.00722054e+02 -5.77640230e+00 1.62575884e+02 -4.27047870e+00 -4.35754129e-01 9.41149723e+01
1716.lowfreq: -13.2554 -9.8217 -3.6223 -0.0026 -0.0024 0.0018 44.0352 62.3011 103.0768
frequency: 43.9572 62.2431 103.0528 119.4896 141.8176 157.5544 166.9024 169.6572 195.7627 234.9974 256.0493 272.5510 278.0203 320.3199 344.8294 368.6864 378.1262 408.6927 431.4630 440.1581 472.5222 487.2781 547.1843 571.2889 611.3999 634.8040 674.2667 751.3526 782.4857 807.0805 861.5646 875.6202 882.9312 906.2882 922.6721 948.1378 996.6777 1029.2917 1050.7347 1064.3902 1076.9900 1097.5867 1110.0713 1177.8123 1191.4497 1205.8200 1212.8139 1257.9775 1266.7882 1307.7855 1327.1009 1347.2394 1350.8916 1381.2883 1383.0220 1396.8073 1418.0608 1449.8694 1457.8678 1462.1865 1474.4564 1548.5729 1577.9321 1626.4429 2947.5162 2980.3866 2992.8790 3019.7285 3032.0867 3058.1653 3119.8378 3120.2738 3164.7466 3184.4758 3575.0843
redmass: 7.8435 5.9853 3.7388 3.4100 4.9553 1.1990 11.3165 5.0520 4.3797 3.5909 1.1005 4.9821 5.9563 8.0740 4.4302 9.6304 5.6382 6.2310 2.3648 4.2676 6.5179 5.2465 4.4266 3.5083 4.5784 4.7414 6.0269 6.2661 7.4743 6.9571 1.4105 1.8758 1.9736 1.6592 2.6810 5.6232 3.9412 1.6986 2.6327 2.3291 2.0193 2.4863 2.3422 1.6276 1.3812 1.3942 2.4188 2.8521 1.2136 1.1971 1.2177 9.4287 1.3637 3.1490 1.3446 1.5595 2.9929 1.0734 1.0557 1.1142 1.0912 8.2858 7.9584 8.0865 1.0639 1.0373 1.0845 1.0628 1.0978 1.0964 1.0992 1.1041 1.0925 1.0935 1.0666
irintensity: 0.0077 0.2053 0.8422 1.0149 0.7424 0.8687 1.6293 0.1244 1.5480 11.0026 160.8075 5.0217 0.3552 3.0201 13.7094 4.7188 7.2830 4.1003 2.8814 6.5352 13.6963 3.8532 8.8114 15.9716 5.3286 4.3754 32.7326 21.4081 34.2984 42.9575 26.4798 28.7248 11.3924 37.6442 2.1697 53.6149 56.2393 2.6005 12.6406 13.9526 5.6254 2.8492 39.5914 28.4794 8.0066 3.9284 97.7911 78.2553 5.7309 3.3460 5.4831 2.3810 2.1188 42.4923 29.0606 13.2990 102.6570 23.8979 18.2096 19.1187 4.1317 48.7334 12.2481 68.8617 35.5183 12.3635 30.4623 24.7228 41.2224 13.2607 13.3429 22.6781 0.4873 1.1864 11.0438
temp: 298.150 k
press: 1.00000 atm
elementType: 17 17 8 8 7 6 6 6 6 6 6 6 6 6 6 6 1 1 1 1 1 1 1 1 1 1 1
symmnumber: 1
zpe: 520820.1 jmol-1
zpe.correction: 0.198370 hartree
zpe.thermalcorrener: 0.213793 hartree
zpe.thermalcorrenthalpy: 0.214737 hartree
zpe.thermalcorrgfe: 0.155618 hartree
zpe.sumelectzpe: -1549.865351 hartree
zpe.sumelectthermal: -1549.849929 hartree
zpe.sumelectthermalent: -1549.848985 hartree
zpe.sumelectthermalfe: -1549.908103 hartree
dipole: -0.8953 -1.4402 -0.5040
dipole: 1.7691
quadrupole: -102.6945 -108.0285 -109.4504
quadrupole: 2.5996 2.8704 -0.6958
quadrupole: 4.0300 -1.3041 -2.7259 2.5996 2.8704 -0.6958
hfenergy: -1550.0637214 hartree
pointgroup: C01 [X(C11H11Cl2N1O2)]
dipole: 0.4145161 -0.5280622 0.1838002 debye
polarizability: 198.4188984|8.9685812|163.9210443|-10.8286702|-1.8772398|95.072967 unknown
InChI: InChI=1S/C11H11Cl2NO2/c1-6-9-2-7(12)3-10(13)11(9)16-5-8(15)4-14-6/h2-3,8,15H,4-5H2,1H3
charge 0 multiplicity 1
27 atoms
Cl -1.053727 3.2401 -0.486724
Cl -4.389626 -0.867045 1.193475
O  0.899566 0.961872 -1.059858
O  3.798609 1.143219 1.234237
N  1.778349 -1.795599 0.056845
C  2.91382 0.425488 0.301012
C  1.970725 1.530345 -0.198864
C  2.166203 -0.737635 1.0167
C  -0.517966 -0.835219 -0.196672
C  -0.28675 0.551305 -0.434887
C  0.580825 -1.836971 -0.466241
C  -1.779885 -1.263123 0.285612
C  -1.327069 1.475184 -0.163156
C  0.254565 -2.952487 -1.439679
C  -2.778335 -0.310664 0.553854
C  -2.577116 1.066387 0.338015
H  3.485412 -0.004084 -0.547287
H  1.537435 2.069168 0.664437
H  2.509683 2.241633 -0.842322
H  2.879907 -1.199361 1.724441
H  1.323189 -0.319428 1.608301
H  -1.969676 -2.324374 0.469399
H  0.012058 -2.535878 -2.43545
H  -0.629499 -3.532714 -1.113261
H  1.118233 -3.629323 -1.526381
H  -3.36538 1.794971 0.541574
H  4.59935 0.591531 1.41908
