program: Gaussian 09
title: 000034125
version: EM64L-G09RevD.01
frameworkgroup: C1[X(C17H24ClN3O2)]
method: RPBEPBE
basis: SDD
operation: Freq
keyword: #p
keyword: freq=noraman
keyword: PBEPBE/SDD
title: #p freq=noraman PBEPBE/SDD
converged: YES YES NO NO
title: Mulliken charges:
elementType: Cl O O N N N C C C C C C C C C C C C C C C C C H H H H H H H H H H H H H H H H H H H H H H H H
charge: -0.063084 -0.248068 -0.250974 -0.086433 -0.064188 -0.356601 -0.353998 -0.360872 -0.380458 -0.372568 -0.317879 -0.399965 -0.614391 0.144613 0.123542 0.265629 -0.345017 -0.303987 -0.272854 -0.099751 -0.389350 -0.040276 -0.551744 0.210446 0.195887 0.187339 0.200496 0.185398 0.206953 0.203631 0.183676 0.223331 0.190962 0.250273 0.232202 0.221178 0.222738 0.186449 0.308003 0.259274 0.269086 0.258724 0.206411 0.239378 0.254974 0.228062 0.213802
chargesum: 0.00000
title: Mulliken charges with hydrogens summed into heavy atoms:
elementType: Cl O O N N N C C C C C C C C C C C C C C C C C
charge: -0.063084 -0.248068 -0.250974 -0.086433 -0.064188 -0.048597 0.052335 0.026964 0.011893 0.014739 0.096415 0.082510 0.015974 0.144613 0.123542 0.265629 -0.085743 -0.034901 -0.014129 -0.099751 0.056439 0.214698 -0.109880
polarizability: 3.11613499e+02 -2.66282063e+00 2.09692795e+02 7.44048120e+00 1.74817776e+00 1.56095073e+02
1716.lowfreq: -19.7991 -4.8624 -2.7705 -0.0021 -0.0020 -0.0012 3.5913 12.1762 16.6874
frequency: -15.5400 12.0655 16.6458 22.6375 39.0814 53.7575 61.4343 67.4103 88.3905 97.8129 125.6407 141.9852 161.8549 192.5083 206.4501 216.8207 223.2635 248.8686 269.8676 275.1635 287.2941 314.4367 324.3938 339.4591 349.6940 376.3371 390.6895 402.7089 420.6110 434.0619 467.6681 489.6949 496.0896 513.6561 560.2429 576.2254 586.9450 619.4089 641.0855 673.5732 702.2134 743.6609 749.3765 752.0487 784.9104 812.7719 814.5439 836.1640 843.2620 848.1167 899.6618 919.0708 944.7173 956.7728 967.2244 974.6128 991.2189 1007.2984 1011.8289 1017.5542 1039.5025 1049.8062 1058.5048 1080.5946 1082.6796 1097.7409 1113.9331 1122.6821 1143.7783 1146.5426 1148.4340 1149.6498 1153.0891 1192.3032 1197.4401 1208.7053 1231.6268 1248.4240 1256.2883 1269.5566 1279.4594 1280.3384 1282.3904 1303.0764 1306.1452 1322.5940 1336.1689 1337.3736 1355.9046 1371.8777 1374.2581 1375.8906 1385.7433 1391.3678 1427.4888 1429.3445 1442.4692 1452.1637 1452.9148 1458.7504 1462.1772 1466.6351 1469.6800 1472.4179 1478.7927 1480.5136 1481.8417 1576.7112 1584.0145 1608.1039 1658.6132 2843.8161 2846.4548 2862.3785 2868.8054 2879.1190 2897.9422 2985.5963 3014.8960 3016.4606 3022.4268 3022.8955 3027.9053 3030.1760 3052.3622 3067.7622 3074.8836 3088.1729 3092.7519 3122.3141 3140.7595 3180.1087 3196.4330 3200.4258 3549.6231
redmass: 2.9272 5.6525 6.5483 4.5779 4.4763 5.6916 4.7562 4.6598 2.0950 2.9385 7.0601 4.0581 3.7973 4.1658 4.7984 1.2226 3.3913 2.1831 2.2383 3.5808 4.6405 2.9649 3.7127 2.5380 2.4979 2.7738 3.7312 2.4379 3.1162 4.9023 4.1533 2.7287 3.8196 4.0521 1.1924 3.7130 4.4624 2.1545 1.9539 4.9536 4.8631 1.9572 3.8555 2.9597 3.0587 2.0218 1.9613 1.7332 2.7109 1.5939 1.8187 2.0399 1.3642 1.3859 3.9036 1.6435 4.4846 2.4419 1.2731 2.7533 2.3389 1.7704 2.0432 1.7778 2.1214 1.7968 2.1902 1.7463 1.8890 2.4322 2.0841 2.7509 2.6174 1.1518 1.4071 2.3203 1.2756 2.0299 1.6972 1.5515 1.2401 1.4579 1.5452 1.1942 1.3247 1.3442 1.2931 1.2778 1.4003 1.4373 1.4230 8.7996 2.8863 1.4034 1.1909 1.1725 1.1438 1.0792 1.0894 1.0810 1.1417 1.9575 1.1026 1.1000 1.1084 1.0537 2.0695 8.8400 6.9071 7.5753 4.6806 1.0685 1.0646 1.0653 1.0692 1.0689 1.0681 1.0640 1.0907 1.0724 1.0636 1.0865 1.0897 1.0885 1.0888 1.0990 1.1009 1.0617 1.1043 1.0946 1.0898 1.0957 1.0922 1.1132 1.0779
irintensity: 0.3783 0.0731 0.5989 1.9378 1.5015 4.4963 0.0449 0.8619 0.9290 0.2968 2.9767 1.7387 1.3482 1.0107 3.9125 0.2035 0.1232 1.6377 2.7103 3.1233 3.4647 3.0205 17.7617 7.1342 4.9968 1.5719 4.3640 0.4940 8.3834 6.8596 3.9453 0.2495 2.8974 29.4357 79.4443 3.0436 12.4541 4.1154 16.6232 5.5220 5.6342 1.9600 4.3448 10.9380 12.1442 13.1808 39.0913 23.6992 50.7703 6.2019 21.9794 2.9829 2.3614 147.9428 60.5618 2.7127 22.4080 44.4747 29.2207 5.5893 10.2017 2.1460 2.9846 2.8190 15.7754 11.2553 36.5789 21.9265 10.1660 6.7833 10.5611 86.9385 54.5116 1.7798 17.1538 79.6751 48.5159 66.1535 28.3586 74.2229 3.8101 19.3474 21.9105 20.0577 0.4275 5.4491 4.8326 5.5615 9.4928 4.5362 19.6606 2.4122 47.7554 5.2082 15.2487 1.2904 38.5904 0.3554 7.6910 61.5869 41.9261 98.5623 22.4494 15.0250 7.9469 8.9190 181.2063 74.9528 81.0174 199.8302 2.1772 63.7779 60.7068 110.1260 62.5449 154.1027 123.5032 43.1623 16.4525 46.0117 37.0219 37.7288 98.0580 27.8438 31.2232 12.4576 35.6613 8.1015 13.6121 3.4100 5.7643 1.8923 1.4628 19.4632 17.8635
temp: 298.150 k
press: 1.00000 atm
elementType: 17 8 8 7 7 7 6 6 6 6 6 6 6 6 6 6 6 6 6 6 6 6 6 1 1 1 1 1 1 1 1 1 1 1 1 1 1 1 1 1 1 1 1 1 1 1 1
symmnumber: 1
zpe: 1014097.9 jmol-1
zpe.correction: 0.386250 hartree
zpe.thermalcorrener: 0.409386 hartree
zpe.thermalcorrenthalpy: 0.410330 hartree
zpe.thermalcorrgfe: 0.329962 hartree
zpe.sumelectzpe: -1435.158347 hartree
zpe.sumelectthermal: -1435.135210 hartree
zpe.sumelectthermalent: -1435.134266 hartree
zpe.sumelectthermalfe: -1435.214635 hartree
dipole: -0.8605 -0.6803 2.4429
dipole: 2.6779
quadrupole: -142.3498 -132.7144 -144.5724
quadrupole: 12.0626 1.8072 1.5075
quadrupole: -2.4709 7.1644 -4.6935 12.0626 1.8072 1.5075
hfenergy: -1435.5445962 hartree
pointgroup: C01 [X(C17H24Cl1N3O2)]
dipole: 0.3657225 -0.152757 -0.9761698 debye
polarizability: 311.0148145|4.2109345|209.582244|11.269403|4.4012482|156.8043087 unknown
InChI: InChI=1S/C17H24ClN3O2/c1-3-12-23-16-13-14(18)4-5-15(16)17(22)19-6-7-21-10-8-20(2)9-11-21/h3-5,13,19H,1,6-12H2,2H3
charge 0 multiplicity 1
47 atoms
Cl -6.660107 -1.493299 -0.787473
O  -0.329099 0.074117 1.383597
O  -2.253771 1.372252 -0.547339
N  3.831782 -0.450766 -0.431578
N  6.436257 0.729443 0.04817
N  0.202556 -1.566253 -0.183476
C  4.067064 0.453631 0.724205
C  4.727954 -0.082878 -1.555873
C  5.535191 0.377751 1.171645
C  6.197708 -0.163587 -1.109834
C  2.404894 -0.538583 -0.813843
C  1.64508 -1.530437 0.104031
C  7.854066 0.764387 0.451339
C  -0.693299 -0.736096 0.478787
C  -2.137873 -0.93066 0.074023
C  -2.937329 0.172649 -0.349418
C  -2.744111 -2.201671 0.199419
C  -4.319693 -0.002107 -0.607089
C  -4.119929 -2.401611 -0.061469
C  -4.876448 -1.284773 -0.454827
C  -3.016266 2.626559 -0.766257
C  -3.724624 3.088171 0.48659
C  -4.999061 3.548512 0.51627
H  3.411659 0.158138 1.562395
H  3.824419 1.512827 0.458976
H  4.524783 0.953326 -1.926632
H  4.559756 -0.788304 -2.391267
H  5.741743 -0.653973 1.557101
H  5.704747 1.093159 1.998353
H  6.854188 0.152321 -1.942783
H  6.438316 -1.230101 -0.862882
H  1.88821 0.45045 -0.774049
H  2.34524 -0.897572 -1.859755
H  1.753979 -1.222672 1.157546
H  2.075833 -2.540848 -0.009842
H  8.475681 1.093422 -0.401062
H  7.988982 1.490809 1.273058
H  8.242103 -0.227166 0.799958
H  -0.138121 -2.121974 -0.970007
H  -2.138608 -3.047883 0.542442
H  -4.954059 0.831852 -0.91042
H  -4.582771 -3.38449 0.054721
H  -3.711756 2.521885 -1.622857
H  -2.217621 3.334432 -1.048357
H  -3.116422 3.055172 1.401019
H  -5.453025 3.913272 1.443672
H  -5.6255 3.583065 -0.384826
