program: Gaussian 09
title: 000033972
version: EM64L-G09RevD.01
frameworkgroup: C1[X(C11H14N2OS)]
method: RPBEPBE
basis: SDD
operation: Freq
keyword: #p
keyword: freq=noraman
keyword: PBEPBE/SDD
title: #p freq=noraman PBEPBE/SDD
converged: YES YES NO NO
title: Mulliken charges:
elementType: S O N N C C C C C C C C C C C H H H H H H H H H H H H H H
charge: 0.261447 -0.299275 -0.391177 -0.144748 -0.156248 -0.441488 -0.428757 0.508229 -0.449018 -0.468625 -0.273967 0.222933 -0.535359 -0.301879 -0.468166 0.265491 0.249571 0.205155 0.215604 0.214179 0.228338 0.231291 0.331038 0.260385 0.264957 0.224301 0.225775 0.224715 0.225299
chargesum: 0.00000
title: Mulliken charges with hydrogens summed into heavy atoms:
elementType: S O N N C C C C C C C C C C C
charge: 0.261447 -0.299275 -0.060139 -0.144748 0.109243 0.013237 0.001026 0.508229 0.010611 -0.468625 -0.013582 0.222933 -0.270402 0.148196 -0.018152
polarizability: 1.96725080e+02 -3.10698858e+00 1.39318599e+02 1.25327038e+01 2.73910533e+00 1.01105762e+02
1716.lowfreq: 0.0003 0.0018 0.0019 5.9938 8.7450 16.9314 33.2166 52.0409 59.1771
frequency: 32.8956 52.0363 59.1710 62.1114 105.2287 147.0206 181.3001 197.9730 268.1933 285.9142 318.5908 347.4126 396.6705 420.4812 449.6965 466.2696 537.0583 599.2302 623.0879 636.3510 648.2968 689.2573 706.7019 723.2274 750.2701 786.6091 819.6073 836.7008 864.1268 866.7910 883.2584 891.2113 916.7165 930.3222 956.4396 980.7102 1016.2632 1022.9809 1075.0089 1084.0055 1097.4875 1105.1041 1150.0733 1156.4952 1157.8270 1185.2725 1197.5098 1205.4613 1215.0336 1247.3165 1282.2315 1301.7711 1308.2334 1325.0791 1336.2924 1339.6379 1359.5505 1385.5314 1455.2780 1466.2174 1468.2561 1473.0272 1481.4817 1489.4199 1491.9086 1578.8232 1673.4121 2965.1387 2985.5532 2989.6116 2993.7400 3003.1103 3024.3719 3025.5675 3040.0582 3053.0151 3067.0778 3095.6899 3168.7951 3238.8820 3595.6115
redmass: 4.4344 2.8600 3.8089 3.8522 3.7755 5.3440 3.7479 3.4584 3.5239 3.4795 5.5608 3.1031 1.0744 4.1441 2.8620 4.2710 4.7098 3.1304 4.0940 4.6814 7.1451 4.1570 2.3833 2.3338 4.7606 4.2505 1.1911 2.3171 2.1253 5.4002 2.2699 1.4468 3.5815 2.9772 4.7086 3.6032 2.4255 3.2047 1.2392 1.5712 1.9049 2.1237 1.5203 1.1443 1.3390 2.0608 1.1256 1.5730 2.0910 1.2679 1.4879 1.3149 1.3059 1.3387 1.4895 1.4223 1.4036 3.6776 1.1308 1.5233 1.1442 1.1239 1.1960 4.9561 1.1035 6.6649 9.5353 1.0639 1.0684 1.0625 1.0588 1.0817 1.0601 1.0940 1.1051 1.1010 1.0989 1.1111 1.0923 1.0996 1.0781
irintensity: 0.0641 2.8016 0.3425 0.2436 4.0885 2.0650 3.1653 4.3010 0.1845 1.1874 1.1742 3.0786 102.1972 12.7056 2.0324 1.0213 7.4307 0.2866 17.8751 19.2808 12.8947 6.6976 15.6500 32.3954 8.9406 19.1884 0.9266 2.2520 18.6494 19.4462 5.8828 13.1492 43.9415 15.6963 45.4727 59.0616 15.2665 18.6629 8.0306 0.1178 3.1029 9.0391 6.5053 0.5425 0.3741 5.9997 4.6911 9.9537 45.6032 17.9922 21.0224 3.9973 7.5529 0.7665 2.7270 8.0307 3.0009 2.8162 6.7135 183.5893 41.1065 19.7840 70.6053 5.9878 10.3931 2.4614 576.2740 30.6712 14.7630 25.9343 78.5821 24.2143 75.3833 27.6604 21.8915 49.5527 28.1119 42.4567 3.2285 0.5069 56.6593
temp: 298.150 k
press: 1.00000 atm
elementType: 16 8 7 7 6 6 6 6 6 6 6 6 6 6 6 1 1 1 1 1 1 1 1 1 1 1 1 1 1
symmnumber: 1
zpe: 614971.2 jmol-1
zpe.correction: 0.234230 hartree
zpe.thermalcorrener: 0.247982 hartree
zpe.thermalcorrenthalpy: 0.248926 hartree
zpe.thermalcorrgfe: 0.192070 hartree
zpe.sumelectzpe: -1009.215507 hartree
zpe.sumelectthermal: -1009.201755 hartree
zpe.sumelectthermalent: -1009.200810 hartree
zpe.sumelectthermalfe: -1009.257667 hartree
dipole: -0.7832 0.2219 0.7498
dipole: 1.1067
quadrupole: -86.6073 -89.0117 -100.5959
quadrupole: 2.3945 -1.4890 3.0302
quadrupole: 5.4643 3.0600 -8.5243 2.3945 -1.4890 3.0302
hfenergy: -1009.4497368 hartree
pointgroup: C01 [X(C11H14N2O1S1)]
dipole: 0.31151 0.1318109 -0.2741956 debye
polarizability: 196.0962883|2.345804|139.421337|14.7306748|2.7543701|101.6318156 unknown
InChI: InChI=1S/C11H14N2OS/c1-2-9(13-11-12-5-6-14-11)8-4-7-15-10(8)3-1/h4,7,9,13H,1-3,5-6H2
charge 0 multiplicity 1
29 atoms
S  -4.057533 -0.63016 -0.531142
O  2.946047 -0.542724 -1.291261
N  0.801073 -0.162877 -0.42608
N  2.750212 0.124499 0.95704
C  -0.189526 0.156476 0.631469
C  -0.306066 1.685206 0.888014
C  -1.130644 2.391703 -0.209908
C  -1.533711 -0.436034 0.242281
C  -2.594325 1.872921 -0.229849
C  -2.597806 0.367395 -0.14759
C  -1.843823 -1.850766 0.232806
C  2.145413 -0.164358 -0.170731
C  -3.140634 -2.132902 -0.151996
C  4.356954 -0.456557 -0.796132
C  4.21323 -0.074215 0.721496
H  0.183372 -0.317994 1.560075
H  0.713008 2.10383 0.959529
H  -0.792478 1.839132 1.872352
H  -0.658249 2.210248 -1.195416
H  -1.130564 3.485184 -0.046057
H  -3.114504 2.222847 -1.141795
H  -3.149339 2.298112 0.632091
H  0.48365 -0.397986 -1.365102
H  -1.119803 -2.622382 0.508209
H  -3.6413 -3.094718 -0.243216
H  4.871933 0.313771 -1.394803
H  4.825708 -1.440186 -0.962613
H  4.594655 -0.874666 1.382548
H  4.76355 0.853303 0.962581
