program: Gaussian 16
title: Title Card Required
version: ES64L-G16RevC.01
frameworkgroup: C1[X(C16H16CoN3O)]
method: UB3LYP
basis: Gen
operation: Freq
keyword: #p
keyword: freq=noraman
keyword: b3lyp/gen
keyword: empiricaldispersion=gd3
keyword: scrf=(solvent=methanol)
keyword: integral=grid=ultrafine
keyword: pseudo=read
keyword: scf=(intrep,xqc,maxconventionalcycles=200)
title: #p freq=noraman b3lyp/gen empiricaldispersion=gd3 scrf=(solvent=methan
basis: NPDir=0 NMtPBC= 1 NCelOv= 1 NCel= 1 NClECP= 1 NCelD= 1
basis: NCelK= 1 NCelE2= 1 NClLst= 1 CellRange= 0.0.
basis: One-electron integrals computed using PRISM.
basis: One-electron integral symmetry used in STVInt
basis: 1 Symmetry operations used in ECPInt.
basis: ECPInt: NShTT= 10585 NPrTT= 53069 LenC2= 9234 LenP2D= 28122.
basis: LDataN: DoStor=T MaxTD1= 6 Len= 172
basis: NBasis= 414 RedAO= T EigKep= 5.28D-04 NBF= 414
basis: NBsUse= 414 1.00D-06 EigRej= -1.00D+00 NBFU= 414
converged: YES YES NO YES
polarizability: 4.23341291e+02 -1.07954216e+00 3.56484953e+02 3.98929551e+00 2.76374668e+01 1.34696459e+02
1716.lowfreq: -10.6891 -0.0006 0.0004 0.0006 14.1611 14.8980 34.4370 45.4763 52.0407
frequency: 33.3194 44.6526 51.8468 68.9924 84.5199 91.6363 114.1826 120.5571 144.1223 177.5291 182.6125 198.7268 217.7456 224.6555 248.4989 265.3513 275.5059 312.5812 353.2399 404.2423 416.0350 421.2809 435.9952 445.4847 460.9372 465.8021 527.3983 541.5895 574.0368 639.5238 647.2455 653.1452 663.2206 672.5455 737.5800 745.0800 755.5566 762.2124 785.3162 811.0492 846.5356 850.1545 912.7788 913.3908 928.3733 994.3179 994.6707 1005.9097 1018.3415 1025.3838 1027.2466 1028.1451 1029.9809 1038.7488 1058.1556 1074.9768 1098.8176 1100.3283 1123.5208 1126.2176 1141.6609 1166.7900 1180.6772 1192.7334 1197.2907 1220.3558 1303.0609 1311.0247 1316.3160 1320.8761 1331.0914 1360.0091 1365.7418 1366.5392 1443.3460 1477.4820 1481.3250 1487.3149 1496.2131 1499.8006 1508.2877 1510.9133 1531.7754 1544.5193 1617.2645 1624.4772 1632.7785 1642.3215 1648.9030 1654.3706 3059.4386 3140.2111 3183.0469 3208.9412 3209.1957 3216.0846 3216.4183 3219.6835 3230.8311 3232.3444 3236.9314 3237.5263 3243.7132 3246.3814 3815.9036
redmass: 5.0452 4.4185 2.6553 4.5822 4.2231 3.4503 5.3175 3.9641 1.8778 6.3351 8.4877 2.5696 4.0758 5.4123 4.7793 5.6940 4.3088 6.5359 5.7038 1.1530 3.3201 3.1246 5.5158 3.1766 3.7781 1.2351 3.1240 4.7743 1.0743 7.5480 3.7770 6.7232 7.3493 7.1016 6.6483 1.7073 4.7655 1.7876 1.1949 2.2439 2.8346 6.0492 1.4075 1.3422 1.3854 1.3943 1.3922 8.3247 1.3442 6.9983 1.3438 1.3458 7.0527 7.3672 4.7294 2.3754 2.1146 1.1014 1.7549 1.5883 1.6631 1.8088 1.2559 1.1449 1.1356 1.2737 2.4511 2.5451 3.1376 1.9878 2.3234 3.2665 1.3064 4.0983 2.4076 2.2352 1.1312 2.1487 1.4153 1.6389 1.0449 2.4461 2.9673 1.0631 5.8269 5.5603 6.7278 5.1228 5.5363 6.3377 1.0324 1.1075 1.1051 1.0904 1.0904 1.0904 1.0905 1.0902 1.0939 1.0944 1.0977 1.0986 1.0925 1.0954 1.0670
irintensity: 2.6361 0.1416 3.6614 1.3078 0.9861 1.0720 0.4764 1.3708 3.9965 3.2633 21.9476 2.8528 3.2987 8.0277 31.3869 1.7993 43.7692 10.5990 3.1373 145.1518 11.6056 2.0055 1.8036 39.7077 0.1565 306.4420 1.9665 6.8233 242.8021 2.1902 0.0366 19.6454 23.4212 16.0549 0.4992 7.5089 13.0434 0.0099 170.2156 0.0108 2.8124 0.0771 0.0626 0.5231 0.2360 0.4399 0.7204 129.7586 0.3497 1.7866 0.4989 0.0807 43.2957 31.4532 0.1371 5.5128 3.8525 45.6530 9.2351 9.3188 1.3279 0.5305 0.2620 9.0565 19.0329 18.9727 4.8185 28.1261 11.9122 0.9295 53.6867 0.8152 32.1911 34.3606 2.9721 11.0085 7.3721 168.7933 2.7782 5.8992 20.7462 277.4491 15.1162 510.5149 24.6228 48.4573 82.9941 54.2887 104.6443 5.0917 39.5955 30.6799 18.0774 8.8855 8.2773 1.5361 4.7948 9.1411 0.6912 4.9416 9.0492 2.8176 5.8582 4.3884 121.5630
temp: 298.150 k
press: 1.00000 atm
elementType: 27 6 6 6 6 6 7 1 1 1 1 6 6 7 6 1 6 6 1 1 6 6 7 6 1 6 6 1 1 1 1 6 1 1 1 8 1
symmnumber: 1
zpe: 761084.9 jmol-1
zpe.correction: 0.289882 hartree
zpe.thermalcorrener: 0.309307 hartree
zpe.thermalcorrenthalpy: 0.310251 hartree
zpe.thermalcorrgfe: 0.240166 hartree
zpe.sumelectzpe: -1004.359021 hartree
zpe.sumelectthermal: -1004.339596 hartree
zpe.sumelectthermalent: -1004.338652 hartree
zpe.sumelectthermalfe: -1004.408737 hartree
hfenergy: -1004.648903 hartree
pointgroup: C01 [X(C16H16Co1N3O1)]
dipole: -0.5315674 2.4569293 1.2181136 debye
polarizability: 423.3412913|-1.0795395|356.4849533|3.9892944|27.6374669|134.6964588 unknown
InChI: InChI=1S/C15H11N3.CH4O.Co.H/c1-3-10-16-12(6-1)14-8-5-9-15(18-14)13-7-2-4-11-17-13;1-2;;/h1-11H;2H,1H3;;/q-3;;+3;
charge 1 multiplicity 4
37 atoms
Co 0.039657 -1.391836 -0.255477
C  -3.040476 -1.635403 -0.661061
C  -4.380329 -1.25429 -0.596868
C  -4.676392 0.087935 -0.366969
C  -3.633375 1.002111 -0.215138
C  -2.316882 0.545817 -0.297883
N  -2.037164 -0.761643 -0.515852
H  -5.705936 0.424146 -0.304979
H  -2.744612 -2.665788 -0.830256
H  -5.162264 -1.994052 -0.722707
H  -3.84725 2.047364 -0.029261
C  -1.126384 1.423349 -0.16681
C  -1.160324 2.818263 -0.074794
N  0.041352 0.763345 -0.163059
C  0.049928 3.505907 0.009406
H  -2.097741 3.3599 -0.080923
C  1.214193 1.412845 -0.116946
C  1.256474 2.80751 -0.021389
H  0.053168 4.588112 0.081022
H  2.19828 3.340385 0.013831
C  2.400906 0.525645 -0.210469
C  3.718193 0.968489 -0.083038
N  2.116181 -0.776813 -0.448176
C  4.756732 0.045287 -0.210116
H  3.936333 2.010113 0.117882
C  3.114666 -1.659487 -0.569819
C  4.455428 -1.291967 -0.461123
H  5.787009 0.370771 -0.112887
H  2.813619 -2.685434 -0.756096
H  5.233819 -2.038327 -0.568792
H  0.04756 -2.991798 -0.580139
C  -0.581507 -0.397771 2.750071
H  -1.638734 -0.236781 2.519741
H  -0.01601 0.507805 2.535787
H  -0.461329 -0.664205 3.802426
O  -0.029274 -1.437031 1.909477
H  -0.380146 -2.296063 2.184701
