program: Gaussian 16
title: Title Card Required
version: ES64L-G16RevC.01
method: UwB97XD
basis: 6-311++G(d,p)
operation: Freq
keyword: #N
keyword: Geom=AllCheck
keyword: Guess=TCheck
keyword: SCRF=Check
keyword: GenChk
keyword: UwB97XD/6-311++G(d,p)
keyword: Freq
keywords: Freq
elementType: C
elementType: H
elementType: O
elementType: N
elementType: Si
hfenergy: -1046.4986687 hartree
pointgroup: C01 [X(C16H29N1O1Si1)]
dipole: -0.4769648 1.1283079 0.6303216 debye
polarizability: 325.9404655|-9.9136774|273.5791815|12.2981353|13.2845842|266.1589552 unknown
InChI: InChI=1S/C16H29NOSi/c1-11(2)19(12(3)4,13(5)6)16-15(17-16)14-7-9-18-10-8-14/h11-13H,7-10H2,1-6H3
charge 0 multiplicity 3
48 atoms
C  -3.8380333 1.51443876 0.0676118
C  -4.4170717 0.19625475 -1.79042643
C  -3.71227044 -1.05466094 -1.23891126
C  -3.08561589 0.36529639 0.75925209
H  -5.28740464 -0.08542395 -2.38287668
H  -3.13785561 2.10367336 -0.54129122
H  -4.29326398 2.17300442 0.80717554
H  -4.46157658 -1.66960976 -0.72448354
H  -3.28788955 -1.64478199 -2.05337337
H  -3.77164595 -0.11123772 1.47090278
H  -2.23067915 0.75039654 1.31875712
H  -3.72464719 0.76051214 -2.4305937
O  -4.88674438 1.02443193 -0.74425635
C  -2.66721553 -0.63340174 -0.26424344
C  -0.03858796 -1.05107213 0.03563244
N  -0.590566 -1.89483765 -1.09616609
C  -1.34500659 -1.07365877 -0.36102854
Si 1.49377064 -0.09914996 0.45595326
C  2.56414858 -1.16149637 1.61019821
H  2.10961796 -1.02141474 2.60167566
C  2.32225863 0.33118206 -1.19854028
H  1.50119931 0.74525733 -1.80062376
C  0.84585636 1.43855673 1.36187515
H  0.09792461 1.03330634 2.05876655
C  4.02629076 -0.69957563 1.69790648
H  4.55783444 -1.25445445 2.47891719
H  4.55205532 -0.88258727 0.75570722
H  4.11965227 0.36541545 1.92658136
C  2.49556573 -2.65995308 1.28150379
H  2.92544482 -2.87278854 0.29773379
H  3.06050458 -3.24166879 2.01874314
H  1.46588747 -3.02734392 1.27843808
C  3.41347059 1.40768411 -1.11098037
H  4.26020075 1.07791061 -0.50277164
H  3.79980081 1.63911269 -2.11026014
H  3.03993958 2.34053349 -0.6809424
C  2.84220759 -0.91737034 -1.92576659
H  3.18096837 -0.66227131 -2.93630006
H  3.69588161 -1.35496925 -1.39844421
H  2.07250808 -1.68886345 -2.01486623
C  1.89002494 2.1833606 2.20400967
H  2.33642746 1.53538845 2.96320363
H  2.70175225 2.58068504 1.58670221
H  1.43062158 3.0317722 2.72358295
C  0.12098662 2.39452411 0.4036945
H  -0.39808509 3.1851334 0.95686778
H  0.82528464 2.8808241 -0.27871338
H  -0.6216008 1.87609176 -0.21107874
