program: Gaussian 16
title: Title Card Required
version: ES64L-G16RevC.01
method: UwB97XD
basis: 6-311++G(d,p)
operation: Freq
keyword: #N
keyword: Geom=AllCheck
keyword: Guess=TCheck
keyword: SCRF=Check
keyword: GenChk
keyword: UwB97XD/6-311++G(d,p)
keyword: Freq
keywords: Freq
elementType: C
elementType: H
elementType: O
elementType: N
elementType: Si
hfenergy: -1235.0584652 hartree
pointgroup: C01 [X(C17H29N1O3Si1)]
dipole: 2.8889337 -3.267744 0.069233 debye
polarizability: 364.7828709|-45.7215655|353.8157546|16.4080892|-12.4280691|286.2799093 unknown
InChI: InChI=1S/C17H29NO3Si/c1-11(2)22(12(3)4)14(23-16(22,5)6)13-17(21-15(19)18-13)7-9-20-10-8-17/h11-12H,7-10H2,1-6H3
charge 0 multiplicity 3
51 atoms
C  -2.228231 -1.844483 -1.494011
C  -2.504257 -2.219815 0.802542
C  -3.073971 -0.82185 1.040899
C  -2.653608 0.172446 -0.045344
C  -2.839318 -0.449184 -1.432657
H  -2.964565 -2.926341 1.493468
H  -1.134633 -1.79449 -1.373775
H  -2.440409 -2.307013 -2.457885
H  -4.165715 -0.874958 1.017056
H  -2.77565 -0.459408 2.028135
H  -3.913667 -0.520248 -1.622078
H  -2.400617 0.193431 -2.200481
H  -1.420723 -2.237269 0.975839
O  -2.780673 -2.690355 -0.503258
O  -3.469566 1.346606 0.054032
C  -2.676832 2.430865 0.24782
O  -3.133292 3.538608 0.354803
C  -1.2674 0.77712 0.143703
N  -1.325476 2.077886 0.29287
Si 1.772466 -0.042898 0.048037
C  2.605354 1.571872 0.561329
H  2.002028 1.931521 1.40486
C  2.312564 -0.792253 -1.598052
H  1.916189 -1.815512 -1.580455
C  1.543408 -1.286397 1.469976
C  1.833702 -0.890529 2.896826
H  1.669014 0.174284 3.079679
H  1.220058 -1.461166 3.601079
H  2.88388 -1.106212 3.13328
C  1.581191 -2.769915 1.190228
H  1.064141 -3.337413 1.970644
H  1.13094 -3.02637 0.227178
H  2.622648 -3.115858 1.163401
C  4.04201 1.368597 1.065718
H  4.444559 2.313218 1.446537
H  4.09509 0.636286 1.875708
H  4.705196 1.029961 0.265077
C  2.541283 2.635812 -0.542716
H  3.164071 2.356801 -1.398382
H  1.519672 2.790721 -0.90156
H  2.91274 3.595545 -0.168455
C  3.838265 -0.883611 -1.740179
H  4.104744 -1.444893 -2.641718
H  4.286083 0.110707 -1.83102
H  4.305346 -1.384793 -0.886886
C  1.679095 -0.076893 -2.800676
H  1.935479 -0.597433 -3.729422
H  0.588332 -0.043968 -2.72658
H  2.037419 0.952285 -2.892342
C  -0.080902 0.035796 0.168497
H  0.226295 -0.88038 1.158447
