program: Gaussian 16
title: Title Card Required
version: AS64L-G16RevC.01
method: UwB97XD
basis: 6-311++G(d,p)
operation: Freq
keyword: #N
keyword: Geom=AllCheck
keyword: Guess=TCheck
keyword: SCRF=Check
keyword: GenChk
keyword: UwB97XD/6-311++G(d,p)
keyword: Freq
keywords: Freq
elementType: C
elementType: N
elementType: O
elementType: H
elementType: Si
hfenergy: -1344.555897 hartree
pointgroup: C01 [X(C17H29N3O3Si1)]
dipole: 1.3379125 -1.9163925 -0.1814184 debye
polarizability: 367.8375706|-7.7225715|330.6192776|-6.8404579|0.2701169|283.3518592 unknown
InChI: InChI=1S/C17H29N3O3Si/c1-12(2)24(13(3)4,14(5)6)11-15-17(7-9-22-10-8-17)23-16(21)20(15)19-18/h12-14H,7-10H2,1-6H3
charge 0 multiplicity 3
53 atoms
C  -2.7350166 2.07808321 0.20183358
C  -0.88086993 0.67498212 -0.05679168
N  -1.35457876 2.00391223 0.01262402
O  -3.21031924 0.834437 0.20360706
O  -3.38759433 3.06969563 0.34094177
C  -2.16359671 -0.15645592 -0.03801075
C  -2.44782266 -0.82500796 -1.38132682
C  -2.18992516 -1.17416823 1.09494537
C  -3.67962051 -1.71954858 -1.29256695
H  -1.57430473 -1.42597924 -1.64656094
H  -2.57906033 -0.06562547 -2.15656175
C  -3.43557676 -2.04985618 1.01563466
H  -1.2944215 -1.79463407 0.99973739
H  -2.14122965 -0.65936403 2.05750365
H  -3.80645731 -2.28085706 -2.2182527
H  -4.5808582 -1.11250148 -1.13075289
H  -3.38271235 -2.84964627 1.75427382
H  -4.33528352 -1.45260924 1.21821099
O  -3.55007833 -2.67239302 -0.25208751
C  0.34936982 0.24121275 -0.11340708
N  0.5309992 3.22489049 -0.14335838
N  -0.6345077 3.18206872 -0.00074891
Si 2.11971173 -0.2487839 -0.07993467
C  2.69414073 -0.05821195 1.71508211
H  3.72404203 -0.4390714 1.73925706
C  1.85328964 -0.90106507 2.68356803
H  1.88899836 -1.96713024 2.44359054
H  2.213038 -0.78228491 3.71150524
H  0.80296905 -0.59048838 2.66356635
C  2.72141719 1.41014267 2.15682711
H  3.07155659 1.49489287 3.19141077
H  3.38239086 2.01681765 1.53176446
H  1.72132479 1.8546813 2.11081935
C  2.29550092 -2.04566092 -0.68376165
H  2.40198699 -1.97093982 -1.77412105
C  3.57410563 -2.69853181 -0.1338839
H  4.469184 -2.10295413 -0.33104611
H  3.50836806 -2.84521706 0.94889327
H  3.72520047 -3.68364916 -0.58816477
C  1.0782048 -2.93465405 -0.39983047
H  0.1696666 -2.54004537 -0.86099492
H  1.2385956 -3.94409465 -0.79415027
H  0.88992247 -3.03041383 0.67422245
C  3.04751603 0.9409466 -1.22600458
H  2.89067349 1.93546845 -0.79192807
C  4.55689161 0.66350163 -1.25002458
H  5.08032267 1.43520487 -1.82476292
H  4.9922194 0.6468795 -0.2460002
H  4.77493679 -0.29808937 -1.72613762
C  2.46744691 0.95653625 -2.6455131
H  1.40439509 1.21370017 -2.64654793
H  2.98989955 1.69157194 -3.26760567
H  2.57671325 -0.01801826 -3.13368217
