program: Gaussian 16
title: Title Card Required
version: AS64L-G16RevC.01
method: UwB97XD
basis: 6-311++G(d,p)
operation: Freq
keyword: #N
keyword: Geom=AllCheck
keyword: Guess=TCheck
keyword: SCRF=Check
keyword: GenChk
keyword: UwB97XD/6-311++G(d,p)
keyword: Freq
keywords: Freq
elementType: C
elementType: H
elementType: O
elementType: N
elementType: Si
hfenergy: -1235.0729419 hartree
pointgroup: C01 [X(C17H29N1O3Si1)]
dipole: -0.8442795 -2.89392 -0.3415172 debye
polarizability: 324.1551134|-2.3600999|338.7919113|0.7843192|9.8812143|281.7276622 unknown
InChI: InChI=1S/C17H29NO3Si/c1-12(2)22(13(3)4,14(5)6)15-11-17(21-16(19)18-15)7-9-20-10-8-17/h12-14H,7-10H2,1-6H3
charge 0 multiplicity 1
51 atoms
C  3.25289052 -2.04991255 0.42711223
C  3.93418067 -0.89403011 -1.49459394
C  3.60658634 0.4706649 -0.9017265
C  2.83692403 -0.76659437 1.14166793
H  4.7824924 -0.81270982 -2.17406393
H  2.39387308 -2.49494727 -0.09535095
H  3.62107316 -2.77344003 1.15428044
H  4.48324766 0.87497243 -0.38952371
H  3.31869614 1.16687367 -1.6934047
H  3.67162332 -0.38107432 1.7330557
H  2.00159959 -0.95979937 1.81864471
H  3.07444421 -1.28161406 -2.05928154
O  4.3038004 -1.82115385 -0.48978044
C  2.47796073 0.3450609 0.13634728
C  1.18633773 0.05182217 -0.49046321
C  0.03618557 0.71495736 -0.09902713
C  1.44188285 2.48984741 0.50833863
O  2.39546733 1.59277421 0.86641769
O  1.6483509 3.66261513 0.69025451
N  0.18062887 2.02182248 0.10642415
Si -1.64921093 -0.2030547 -0.04539349
C  -2.88609103 0.96895095 0.76678543
H  -2.34435108 1.38129697 1.62915413
C  -4.14077562 0.26115357 1.30127348
H  -3.90022817 -0.51826949 2.02846528
H  -4.79716085 0.98309855 1.79896345
H  -4.71735863 -0.2021284 0.49533168
C  -3.26929549 2.1444981 -0.14466904
H  -2.38946612 2.67606713 -0.5147998
H  -3.8499724 1.80391426 -1.00756063
H  -3.89053153 2.86211714 0.4021618
C  -2.05643404 -0.74147817 -1.81537929
H  -1.41772206 -1.61977511 -1.98463953
C  -3.51967723 -1.1853588 -1.97147777
H  -3.8140169 -1.9377004 -1.23501755
H  -4.20178115 -0.33606802 -1.86840219
H  -3.68206034 -1.61396732 -2.96606953
C  -1.69599278 0.30773989 -2.87710017
H  -1.91664863 -0.07585584 -3.8790919
H  -2.27286643 1.22764472 -2.74390918
H  -0.63551557 0.57144501 -2.84890456
C  -1.18728108 -1.69115015 1.03649614
H  -0.23013785 -2.03847645 0.6148482
C  -0.92897988 -1.27142105 2.49098504
H  -0.50603809 -2.10221452 3.06532799
H  -0.23300195 -0.42895134 2.5653216
H  -1.85625155 -0.96853242 2.98659351
C  -2.15936014 -2.87527945 0.95879001
H  -2.25794725 -3.25223604 -0.06256067
H  -1.80402834 -3.70212197 1.58303872
H  -3.15814738 -2.60364857 1.3135686
