program: Gaussian 16
title: 33 TSS
version: ES64L-G16RevC.01
method: UwB97XD
basis: 6-311++G(d,p)
operation: Freq
keyword: #N
keyword: Geom=AllCheck
keyword: Guess=TCheck
keyword: SCRF=Check
keyword: GenChk
keyword: UwB97XD/6-311++G(d,p)
keyword: Freq
keywords: Freq
elementType: C
elementType: H
elementType: O
elementType: N
elementType: Si
hfenergy: -1425.3503755 hartree
pointgroup: C01 [X(C24H27N1O2Si1)]
dipole: -1.5700045 -4.1888954 0.207025 debye
polarizability: 435.6723294|0.3319436|484.8379359|-4.0227344|-35.4688567|397.0978931 unknown
InChI: InChI=1S/C24H27NO2Si/c1-22(2,3)28(18-12-6-4-7-13-18)20(24(28)16-8-5-9-17-24)19-23(14-10-11-15-23)27-21(26)25-19/h4-9,12-13,16-17H,10-11,14-15H2,1-3H3
charge 0 multiplicity 3
55 atoms
C  3.93248442 -1.32951266 0.08908111
C  3.25932609 -1.51059157 -1.27682564
C  3.220915 -0.09200957 -1.83902306
C  2.83307243 0.76321691 -0.62373693
C  3.41470608 0.02523766 0.60944982
H  3.70837311 -2.14386914 0.77949886
H  5.01763213 -1.29133663 -0.04079228
H  2.23910081 -1.88727032 -1.1497152
H  3.78815752 -2.20629314 -1.9303368
H  4.22166602 0.21843489 -2.15319044
H  2.53976371 0.041341 -2.68150524
H  2.65283178 -0.10223225 1.37857263
O  3.33843422 2.0977092 -0.72815191
C  2.30834211 2.97487782 -0.64903034
O  2.48057653 4.16495408 -0.68507111
H  4.20779499 0.63962181 1.03641865
C  1.34321593 1.0344845 -0.53614349
N  1.07960371 2.31309048 -0.54235836
C  0.36109104 0.03222611 -0.44256443
Si -1.31186162 -0.61937257 -0.35298401
C  -2.65699911 0.62302627 -0.0060436
C  -3.93189503 0.20360234 0.39747832
C  -2.40072133 1.99670367 -0.09957327
C  -4.92388544 1.12962804 0.69530537
H  -4.16199807 -0.85353425 0.48590391
C  -3.39515861 2.92332774 0.19779022
H  -1.416909 2.34679838 -0.39789676
C  -4.6559964 2.49157298 0.59376315
H  -5.90491048 0.78916554 1.00686582
H  -3.18335705 3.98384799 0.11974586
H  -5.43015174 3.21474482 0.8250382
C  -0.07553145 -0.84520365 1.07611024
C  -0.10375351 0.06627894 2.20049777
C  0.65289642 -2.07827807 1.27847404
C  0.57075029 -0.2136393 3.36404893
H  -0.65777135 0.99463606 2.10796139
C  1.30576628 -2.33639604 2.46114503
H  0.68832985 -2.81458184 0.48521311
C  1.2889788 -1.410953 3.51342858
H  0.53548531 0.49748184 4.18229455
H  1.83861895 -3.27400504 2.57750139
H  1.81595273 -1.62156083 4.43600168
C  -1.76413943 -2.09973867 -1.44841129
C  -2.79302082 -1.62034299 -2.4907957
H  -2.3971682 -0.81091946 -3.11211113
H  -3.0460124 -2.4551083 -3.15419106
H  -3.71853518 -1.26892046 -2.02848754
C  -2.37651014 -3.22425212 -0.59518359
H  -3.2853613 -2.90401182 -0.07746012
H  -2.64922188 -4.06502376 -1.24333512
H  -1.67411926 -3.59527891 0.15629092
C  -0.52706324 -2.63015628 -2.19241054
H  -0.04120811 -1.85008268 -2.78480146
H  0.21903119 -3.05312607 -1.51624255
H  -0.8351323 -3.43048867 -2.87489659
