program: Gaussian 16
title: Title Card Required
version: ES64L-G16RevC.01
method: RwB97XD
basis: GenECP
operation: Freq
keyword: #P
keyword: Geom=AllCheck
keyword: Guess=TCheck
keyword: SCRF=Check
keyword: GenChk
keyword: RwB97XD/GenECP
keyword: Freq
converged: YES YES YES YES
title: Mulliken charges:
elementType: C C C C C C C C C C C C C C C C C C C C H H H H H H H H H H H H H H H H H H H H H N N Rh H N C C C C H H C H H C H H H H O H H O H H O H H H C O O H C O O H
charge: -0.095977 -0.133905 -0.098751 -0.132203 0.104492 0.106860 -0.036898 0.275475 -0.036184 0.283459 -0.098143 0.137566 -0.100107 0.092581 0.085692 -0.418227 -0.414714 -0.415514 -0.415311 -0.420775 0.198326 0.189942 0.198165 0.189721 0.167171 0.172441 0.129434 0.139949 0.152743 0.134913 0.139230 0.155957 0.142978 0.141762 0.151186 0.142520 0.150632 0.142381 0.155081 0.144831 0.132633 -0.548173 -0.548055 -0.009050 0.268634 -0.496957 -0.090849 -0.097289 -0.072355 0.016900 0.151940 0.156638 0.022260 0.150275 0.151212 0.032391 0.144945 0.155533 0.139076 0.127411 -0.572271 0.133967 0.138387 -0.575323 0.115674 0.124927 -0.594220 0.354382 0.351331 0.350365 0.577337 -0.500299 -0.464962 0.376566 0.576800 -0.500153 -0.465047 0.376643
chargesum: 1.00000
title: Mulliken charges with hydrogens summed into heavy atoms:
elementType: C C C C C C C C C C C C C C C C C C C C N N Rh N C C C C C C O O O C O O C O O
charge: 0.102349 0.056037 0.099413 0.057517 0.271662 0.279300 -0.036898 0.275475 -0.036184 0.283459 -0.098143 0.137566 -0.100107 0.092581 0.085692 0.003900 0.015386 0.020411 0.020222 0.011770 -0.548173 -0.548055 -0.009050 -0.228323 0.217729 0.204197 0.228123 0.283387 0.294613 0.272992 -0.217889 -0.223992 -0.243855 0.577337 -0.123733 -0.464962 0.576800 -0.123510 -0.465047
polarizability: 6.07415947e+02 -6.08651298e+00 5.28487760e+02 -7.13365966e+00 -1.06198458e+02 4.79317045e+02
1716.lowfreq: -972.0599 -7.4742 -5.2285 -0.0003 0.0003 0.0004 4.8262 17.7567 22.4323
frequency: -972.0597 17.6486 22.3359 28.2734 37.1005 41.3630 42.3071 47.5844 55.2334 60.1349 68.2827 70.1203 76.4635 83.1343 85.6777 92.3257 110.1029 115.8075 116.5993 124.3455 129.3963 134.9464 141.1220 146.7786 149.8455 156.1469 177.2311 179.7300 190.5274 192.2975 199.5339 200.5515 207.7413 216.6848 222.0292 234.3971 239.4102 241.4239 243.8994 263.4951 273.7375 279.2961 290.4893 294.7088 299.2832 302.7087 315.3296 318.3686 319.4197 326.6570 343.6159 355.7592 366.6912 395.4542 403.2340 431.2267 438.1116 442.5918 449.2998 460.4178 483.2346 509.0341 521.6174 528.0516 537.7481 541.1793 545.5827 550.3787 556.7009 563.9837 601.3882 607.0076 613.8515 626.7030 641.9803 655.0681 656.1719 675.5169 685.6581 720.7279 747.1263 755.0583 776.1167 808.7107 816.3654 819.5530 820.5640 823.6735 826.6498 840.7438 863.6057 877.4898 888.3426 930.1864 970.2738 973.4304 976.0413 977.6973 980.0335 1017.4622 1024.1142 1033.7896 1050.3003 1052.7269 1056.9015 1057.8152 1064.1002 1064.5763 1067.4527 1074.5588 1077.7183 1086.6252 1094.8372 1099.6303 1101.9743 1115.2894 1125.2956 1130.0289 1131.1344 1134.7104 1166.9441 1174.3138 1176.4420 1177.3111 1186.2782 1187.6423 1193.6269 1207.0464 1220.5976 1221.9804 1226.4808 1260.0453 1275.4843 1281.4742 1287.3321 1291.5582 1302.1029 1320.9184 1321.8052 1334.7494 1337.0618 1344.3118 1350.2264 1371.3832 1384.6871 1394.9416 1400.2969 1401.0169 1405.8058 1417.7842 1418.7012 1420.5663 1423.2008 1424.6898 1429.8157 1432.5180 1441.0106 1444.3727 1447.0151 1459.9780 1467.5401 1481.0136 1481.6183 1484.2667 1485.4583 1490.9790 1491.4810 1492.1363 1495.4999 1499.5562 1500.5036 1503.7637 1506.3540 1509.2882 1520.1618 1526.3458 1529.9900 1532.8810 1534.2574 1539.3259 1542.6943 1544.9344 1552.4844 1612.6983 1644.0365 1658.9004 1696.9035 1698.5802 1847.7299 1849.2480 3035.1229 3040.7831 3052.3307 3053.0054 3055.5181 3056.7022 3059.3290 3060.2983 3071.6047 3076.7275 3077.0496 3111.3698 3113.7447 3116.1699 3117.1489 3126.7891 3129.4938 3129.9449 3146.6842 3154.3098 3158.9793 3160.1706 3162.4889 3165.1733 3165.4569 3168.6830 3187.7127 3260.2435 3263.7200 3271.4609 3272.1496 3275.4307 3276.3888 3841.1311 3841.6917 3907.5726 3922.3338 3929.6800
redmass: 1.1442 6.0112 5.2319 7.9814 5.8949 5.2607 4.6195 11.5136 5.1732 6.8885 5.3315 5.7832 4.3438 4.8424 5.4465 5.8440 3.0561 3.0420 2.3905 2.1600 2.7400 1.2365 1.4650 1.2842 3.7716 2.5874 2.8587 2.2531 3.3265 2.1181 3.5602 2.9291 4.8330 1.8950 2.4104 6.1266 3.3179 1.7510 1.7683 2.4962 1.5357 1.4106 2.3484 4.9941 1.9961 2.4087 4.0401 2.6589 2.5805 1.8259 4.7698 2.6596 5.1861 8.4999 4.2386 4.0804 2.8089 3.0520 4.4698 6.2934 3.4193 2.2797 6.2758 6.6520 4.0514 3.0544 4.2461 2.2181 4.8454 2.4844 3.8691 1.3124 1.3867 4.0492 4.0160 3.1560 4.5522 7.7527 5.5861 5.1599 5.6791 3.4720 3.3294 1.7403 2.5159 3.7606 2.5752 4.2196 1.2416 1.5230 6.3635 1.5249 1.9854 2.3007 1.5416 1.5336 1.6427 1.8227 1.4874 1.3942 1.3582 2.2187 1.3861 1.4274 2.8115 1.4132 3.3563 1.6612 1.5623 2.6454 2.1682 2.2642 3.2549 1.8484 1.8783 3.2886 2.8560 1.8452 2.5115 3.1136 2.1498 1.7999 1.8876 2.0704 3.6108 2.3838 2.0938 1.7249 1.2186 1.6519 1.7611 1.1432 1.2227 1.1077 1.2651 1.1192 1.7158 1.5813 1.2685 4.0535 1.1300 3.1355 2.6964 1.1723 1.2558 1.9357 1.6088 1.6189 1.3261 2.7165 1.3629 2.5578 1.2848 1.2764 1.3516 1.2572 2.8860 2.4561 1.8743 1.4120 4.4525 1.4824 1.5145 1.1302 1.0518 1.3772 1.2834 1.0993 1.1982 1.0977 1.0961 1.1201 1.1534 1.0747 1.1503 1.0899 1.5108 1.9497 1.9410 1.6089 1.2413 1.0894 4.0217 5.3440 5.9479 7.1746 6.5184 7.0147 11.2296 11.2162 1.0577 1.0632 1.0423 1.0389 1.0395 1.0661 1.0394 1.0405 1.0757 1.0953 1.0704 1.0624 1.0977 1.1017 1.1017 1.0948 1.0976 1.0986 1.0977 1.1028 1.1011 1.1006 1.1027 1.0988 1.1034 1.1046 1.0943 1.0909 1.0905 1.0950 1.0955 1.0942 1.0949 1.0649 1.0649 1.0666 1.0667 1.0666
irintensity: 9449.5206 0.4375 0.6301 0.1515 2.7573 4.3446 1.9877 0.2434 1.2535 0.4267 3.0298 1.3949 9.6948 0.3564 2.1504 1.1106 4.9786 4.0573 10.1577 9.6428 1.4511 0.6391 3.1383 2.5030 0.3911 34.4086 26.1283 0.7956 7.9988 17.0745 23.5402 0.9689 7.5632 10.9486 54.7934 5.7472 29.8684 1.4684 80.5100 0.7016 72.0301 175.8265 11.1253 20.0142 32.4493 43.5465 5.7423 21.0611 16.2584 4.0437 20.6516 16.1706 51.1487 41.7477 1.5484 1.3045 14.7410 38.8766 0.1672 2.8308 2.9198 14.1217 33.1349 14.8135 1.3766 13.0007 3.3605 0.1873 0.5421 0.0516 3.0224 291.7782 14.3979 9.0766 9.4984 9.5528 201.4953 0.0292 32.2419 10.9004 0.9379 0.0040 191.5465 21.1446 9.9086 1.9661 7.2738 42.3313 8.6416 13.9695 12.7951 25.8803 0.0772 9.5971 1.2520 6.8019 14.8392 5.0787 0.9114 0.0219 0.0508 63.6095 19.0186 17.1990 31.3182 50.7854 15.7627 13.3682 4.0820 12.1991 13.2253 150.6838 6.7472 15.9554 10.9423 46.9195 46.4175 32.0507 100.6113 15.1523 55.4279 151.9393 20.7153 66.7800 8.4556 119.1972 36.2442 7.3276 279.6553 333.4537 184.9711 68.0127 13.4580 11.5801 9.2167 46.1437 5.2776 1.5022 26.6963 65.2186 11.9984 28.5707 90.8323 19.0049 7.4084 7.6476 5.8045 9.0716 27.0849 727.3210 39.9834 43.1005 13.3933 12.8688 16.4561 43.2161 207.8093 2.7832 4.0545 5.0215 193.0955 1.7208 6.8664 6.1197 6.8094 18.2739 2.3201 0.2528 10.7167 11.4103 13.7742 7.4076 24.7300 30.2417 17.8470 11.2787 1.5692 13.6968 4.4336 10.6834 15.6284 8.7929 28.7405 21.3379 10.8135 26.3726 34.0332 128.8804 306.7678 675.3349 59.9530 72.2292 83.5033 69.8150 53.5319 44.6975 69.6909 45.3134 50.4042 59.1563 36.1347 33.1598 25.6127 30.4519 18.6118 29.7775 17.4420 19.1637 29.7856 27.1786 18.6599 22.2577 23.2955 29.5160 6.6649 19.0918 7.1525 0.0305 2.5305 1.6464 2.7090 0.6260 5.2490 237.8746 194.9361 72.5703 81.3555 72.8769
temp: 298.150 k
press: 1.00000 atm
elementType: 6 6 6 6 6 6 6 6 6 6 6 6 6 6 6 6 6 6 6 6 1 1 1 1 1 1 1 1 1 1 1 1 1 1 1 1 1 1 1 1 1 7 7 45 1 7 6 6 6 6 1 1 6 1 1 6 1 1 1 1 8 1 1 8 1 1 8 1 1 1 6 8 8 1 6 8 8 1
symmnumber: 1
zpe: 1710190.1 jmol-1
zpe.correction: 0.651377 hartree
zpe.thermalcorrener: 0.693796 hartree
zpe.thermalcorrenthalpy: 0.694740 hartree
zpe.thermalcorrgfe: 0.575108 hartree
zpe.sumelectzpe: -1889.583359 hartree
zpe.sumelectthermal: -1889.540940 hartree
zpe.sumelectthermalent: -1889.539995 hartree
zpe.sumelectthermalfe: -1889.659628 hartree
dipole: 399.8142 -115.2367 -183.7454
dipole: 454.8553
quadrupole: 33061.2479 2571.5377 6841.4676
quadrupole: -9599.9281 -15307.0012 4417.1766
quadrupole: 18903.1635 -11586.5467 -7316.6168 -9599.9281 -15307.0012 4417.1766
hfenergy: -1890.2347359 hartree
pointgroup: C01 [X(C28H39N3O7Rh1)]
dipole: -4.1178005 -1.8007115 -0.8095381 debye
polarizability: 607.415947|-6.086513|528.4877604|-7.1336597|-106.1984579|479.3170453 unknown
InChI: InChI=1S/C12H8N2O4.C10H15.C6H15NO3.Rh.H/c15-11(16)7-1-3-9(13-5-7)10-4-2-8(6-14-10)12(17)18;1-6-7(2)9(4)10(5)8(6)3;8-4-1-7(2-5-9)3-6-10;;/h1-6,15,17H;1-5H3;8-10H,1-6H2;;/q-2;;;+2;
charge 1 multiplicity 1
78 atoms
C  82.37578958 -20.07322176 -38.32033211
C  82.34693216 -21.15040006 -37.44968131
C  82.6835885 -24.66856614 -34.80828703
C  82.50825106 -23.55554326 -35.61456765
C  84.99763323 -24.65537803 -35.42699856
C  84.71701422 -20.47933991 -38.62378172
C  83.58727769 -19.72924547 -38.91862811
C  83.5201498 -21.85732897 -37.1922556
C  83.95666771 -25.22802373 -34.70966769
C  83.59846409 -23.02639716 -36.30191686
C  88.16210918 -21.55467134 -37.89157041
C  88.49728193 -22.94060007 -37.84169178
C  88.2993775 -23.36348363 -36.49411181
C  88.07051547 -22.17541115 -35.66778299
C  87.98738289 -21.07467196 -36.51811506
C  89.09437945 -23.75216211 -38.94843031
C  88.33486519 -20.65923023 -39.08255471
C  87.69966839 -19.6477528 -36.16652703
C  87.89396767 -22.21990663 -34.18149729
C  88.64161618 -24.71612907 -35.94269925
H  81.47454741 -19.51183482 -38.53343701
H  81.4156531 -21.43459216 -36.9778418
H  81.84855982 -25.09453206 -34.26592631
H  81.52786143 -23.10651899 -35.70352898
H  85.99263755 -25.07949122 -35.37856779
H  85.66619549 -20.24805645 -39.08951552
H  88.72407314 -23.43998402 -39.92863302
H  88.8979266 -24.81959317 -38.82249569
H  90.18278606 -23.6156545 -38.9554716
H  87.77149885 -19.72830519 -38.97427174
H  88.01354763 -21.14504299 -40.00766355
H  89.38845264 -20.38214544 -39.20308791
H  87.41304762 -19.54029274 -35.11844147
H  86.88342744 -19.24670022 -36.777349
H  88.57665157 -19.01579477 -36.34465654
H  87.55798977 -21.25936446 -33.78565397
H  88.83383849 -22.48178622 -33.68312508
H  87.15463396 -22.97540552 -33.8935417
H  89.71101062 -24.7678776 -35.70710195
H  88.42109541 -25.51840761 -36.65166467
H  88.10436142 -24.92128369 -35.01221521
N  84.69330414 -21.51818434 -37.78237133
N  84.83176257 -23.58402038 -36.20992209
Rh 86.36241998 -22.62040193 -37.23178138
H  85.81320172 -23.60214813 -38.5516568
N  85.30802907 -24.29305474 -39.6681764
C  83.91220937 -24.61178601 -39.31048224
C  86.18120445 -25.46765337 -39.82570547
C  85.49034882 -23.27624027 -40.72042276
C  83.06020269 -25.3441643 -40.33432519
H  83.41421098 -23.66727779 -39.07782024
H  83.94421273 -25.1976804 -38.38832931
C  86.33868994 -26.25958565 -38.5251729
H  87.16710469 -25.09685863 -40.10572056
H  85.83230152 -26.11903285 -40.63656238
C  85.5683321 -23.77660149 -42.15739812
H  86.41686586 -22.7392081 -40.48518129
H  84.66662868 -22.56339208 -40.64093895
H  82.21256242 -25.79086299 -39.79745326
H  83.62290384 -26.1665933 -40.79659924
O  82.61187546 -24.41125513 -41.29874591
H  86.43790433 -25.55119752 -37.69879878
H  85.46393481 -26.89258167 -38.33020989
O  87.52635202 -27.02284776 -38.53852456
H  86.43374908 -24.44084654 -42.28555404
H  84.65792146 -24.33108666 -42.40944796
O  85.70467241 -22.60965299 -42.94727646
H  82.14525337 -24.89154981 -41.98856376
H  87.42385087 -27.74264481 -39.16857637
H  85.78492071 -22.88129854 -43.86531737
C  83.74101196 -18.59585546 -39.87450084
O  82.59214612 -17.95767859 -40.09810947
O  84.79449418 -18.29054303 -40.38937627
H  82.76464164 -17.23830151 -40.72268244
C  84.26912138 -26.42204361 -33.87389502
O  83.19704672 -26.89459578 -33.23804311
O  85.3759409 -26.90704555 -33.7843572
H  83.47088325 -27.6635582 -32.71742185
