program: Gaussian 16
title: Title Card Required
version: ES64L-G16RevC.01
method: UwB97XD
basis: GenECP
operation: Freq
keyword: #P
keyword: Geom=AllCheck
keyword: Guess=TCheck
keyword: SCRF=Check
keyword: GenChk
keyword: UwB97XD/GenECP
keyword: Freq
title: #p opt=(nofreeze,ts,noeigentest,readfc,maxstep=10) geom=checkpoint gue
basis: NPDir=0 NMtPBC= 1 NCelOv= 1 NCel= 1 NClECP= 1 NCelD= 1
basis: NCelK= 1 NCelE2= 1 NClLst= 1 CellRange= 0.0.
basis: One-electron integrals computed using PRISM.
basis: 1 Symmetry operations used in ECPInt.
basis: ECPInt: NShTT= 42195 NPrTT= 221648 LenC2= 31279 LenP2D= 89309.
basis: LDataN: DoStor=T MaxTD1= 6 Len= 172
basis: NBasis= 798 RedAO= T EigKep= 4.27D-04 NBF= 798
basis: NBsUse= 798 1.00D-06 EigRej= -1.00D+00 NBFU= 798
converged: YES YES YES YES
polarizability: 5.70923825e+02 -2.14970036e+01 7.62506495e+02 1.60570918e+01 -2.69847360e+02 6.50427851e+02
1716.lowfreq: -611.2625 -5.1574 -4.4918 -0.0010 -0.0009 -0.0004 3.1792 16.4784 21.8042
frequency: -611.2622 15.7608 21.7628 22.9838 28.7791 30.0782 42.0161 48.1912 54.1930 56.1931 59.2564 64.7103 71.3546 73.8393 78.7160 82.2513 85.6581 88.6846 97.0045 109.0747 114.6050 121.9043 122.3587 131.5849 135.1951 143.7660 147.2107 153.9569 169.2276 170.0949 186.1930 187.1943 192.6576 194.9526 197.9555 204.3035 210.9856 211.3090 213.5113 229.8580 234.6764 243.0879 248.8620 249.2030 261.2978 272.8385 287.6644 299.1330 306.2278 312.6411 324.8810 328.5424 342.5533 350.0792 377.9409 394.9035 405.2162 413.1164 432.7180 437.8288 450.3367 450.7863 451.8494 457.5659 463.2052 471.3653 494.5457 517.1278 526.2070 536.2964 543.6913 548.7652 552.3167 554.1063 566.2472 574.7795 580.3607 585.9167 604.8007 623.4383 626.6767 634.1923 642.4438 678.9172 685.4614 697.5877 723.0974 736.0698 766.6629 783.8328 797.5461 810.9826 817.4150 823.3195 828.5186 829.8246 830.4418 831.0004 842.3528 889.2582 913.3939 931.6907 932.3255 975.3375 977.9540 988.9024 991.4456 999.9330 1005.7080 1020.8922 1046.4876 1049.7698 1052.0945 1052.9620 1054.6737 1058.5820 1062.5877 1066.7561 1076.9542 1080.7885 1090.4122 1104.5959 1108.1560 1109.7023 1119.5790 1133.5331 1145.3059 1150.9996 1151.7711 1153.4378 1172.3294 1173.3413 1179.1593 1188.3373 1196.2561 1208.3977 1216.5405 1222.3494 1226.0057 1257.3915 1261.8673 1283.4769 1294.9470 1309.1274 1317.7400 1325.1071 1328.9037 1343.8188 1360.0194 1360.7477 1364.3222 1390.1127 1392.2172 1403.3492 1404.0358 1408.6824 1411.4925 1426.9542 1429.0718 1429.7053 1436.2060 1440.3475 1448.9882 1451.5640 1457.0483 1458.4535 1467.0041 1478.9281 1482.7760 1483.8200 1485.8017 1486.2272 1486.9449 1488.9487 1489.9888 1493.2860 1498.8006 1500.4477 1503.0075 1508.6299 1511.9078 1516.6935 1519.5328 1524.6166 1525.1104 1527.3892 1539.7867 1540.8429 1543.6470 1544.0802 1561.4743 1567.5790 1593.7379 1650.2791 1702.7341 1738.9793 1797.0810 1806.4828 2177.3018 2950.0970 2952.4173 2979.0327 3021.5578 3022.2341 3026.9892 3062.6503 3067.0818 3070.7932 3071.3827 3072.3915 3074.7500 3078.5811 3110.1158 3114.6541 3127.4189 3132.6667 3145.5825 3146.3366 3146.4231 3155.7698 3162.5906 3172.2932 3173.3260 3174.1516 3180.0050 3192.8805 3241.2346 3245.7019 3256.8097 3259.4114 3261.7042 3275.9595 3822.8251 3851.8961 3853.6665 3883.7698 3927.1278
redmass: 3.6161 6.7925 5.8205 5.9252 7.8717 4.5460 4.0837 5.5334 5.5498 7.5268 6.4420 5.6922 8.3072 7.2837 6.7371 3.6089 4.9516 3.8320 4.2226 1.6288 1.7953 1.5915 4.1922 3.9307 4.3850 6.0613 3.6224 1.3542 2.4203 2.9743 2.5143 3.1494 4.3422 2.5400 1.9589 5.0115 3.0163 2.1233 2.6563 3.2887 3.0623 3.8983 4.7565 1.9074 1.7226 4.1040 5.9175 5.3810 2.1531 2.5778 2.4580 2.7316 2.7559 2.4922 2.4232 8.4824 1.2580 3.1549 4.7657 2.4756 3.8378 3.2878 3.3686 4.3628 4.0679 6.8815 1.2076 2.2450 6.0420 6.7266 4.3798 4.1312 2.4265 4.8870 2.4623 1.2120 1.2686 2.8383 4.0496 3.9479 4.1868 4.1681 4.6013 7.6669 5.4467 5.2081 5.4789 3.6207 3.8975 6.7097 1.7488 5.6973 1.8295 2.2853 1.6035 1.8517 1.6431 1.7315 6.4151 2.1708 2.3204 1.1045 1.9029 1.4284 1.4552 1.4102 1.4555 1.3329 1.3096 2.2817 4.2463 3.1858 2.3642 2.0881 1.8605 1.4541 1.5018 1.5024 1.8580 1.4758 1.9907 2.5149 1.8454 1.8356 3.6997 1.7380 3.8214 3.6273 3.2222 3.6005 1.6968 1.3610 3.0438 1.4614 3.5664 1.8828 1.6751 2.6700 2.6192 1.2078 1.1750 1.6031 1.3546 1.5130 1.1229 1.3747 1.1351 1.2186 3.3851 3.0161 1.1669 2.8928 2.1042 1.2474 1.4528 1.4605 1.4539 1.2306 1.2793 1.2743 1.3228 1.2849 4.6164 1.3652 1.9240 2.2089 1.6096 1.1985 2.1344 1.4020 1.5290 1.5426 1.6323 1.7423 1.7894 1.1867 1.1426 1.1438 1.1348 1.1203 1.1082 1.9393 1.5120 1.2895 1.4228 1.0989 1.1086 2.1306 5.7171 1.1875 3.5829 6.1626 4.3877 6.1578 6.6020 1.3264 10.1251 10.2250 12.7060 1.0732 1.0720 1.0720 1.0619 1.0651 1.0694 1.0450 1.0386 1.0390 1.0396 1.0966 1.0993 1.0392 1.0933 1.0890 1.0910 1.0899 1.1003 1.0990 1.0988 1.0990 1.0937 1.1030 1.1028 1.1035 1.1025 1.1023 1.0882 1.0879 1.0972 1.0919 1.0957 1.0922 1.0664 1.0648 1.0648 1.0665 1.0666
irintensity: 5207.4827 0.3009 0.0168 1.4535 0.7620 1.5641 0.7632 1.1417 3.1761 0.0888 2.4282 11.1491 9.6693 2.1445 1.3482 5.6770 0.0623 1.3653 4.9887 0.6161 2.2923 1.0458 6.2170 1.6723 0.5180 0.1269 2.5524 0.6916 2.4912 6.8104 16.6887 60.1633 3.8097 4.3003 2.2906 24.5877 1.4866 28.1173 28.4983 25.1841 20.3953 16.9188 18.9398 175.4166 65.6783 5.2735 7.1781 3.0030 4.7021 5.5339 1.3046 9.2414 2.3576 16.9469 52.3789 34.7363 189.6142 50.0965 43.8005 9.3883 4.3785 8.3878 23.3139 12.6903 18.5745 20.2103 138.3572 13.8435 18.1876 0.2715 2.0751 3.2451 20.4022 12.4619 0.0680 254.2162 6.0519 26.7431 1.0023 16.8518 4.9686 71.6511 497.6755 2.9823 2.4071 1.2173 13.5575 0.2791 202.4736 0.4158 14.1153 0.3705 1.0458 0.2172 12.9695 1.3892 7.0236 0.1430 22.6258 0.1991 70.2480 3.9713 25.9317 23.5055 7.2138 2.4451 0.9474 1.0492 0.4150 139.3561 612.9527 323.9759 14.2178 22.5694 20.8559 29.3937 13.4399 21.5677 10.5502 14.4225 44.3672 24.6217 18.5115 14.6936 113.0938 0.2812 178.8214 2643.6423 90.6308 325.1963 28.3528 821.9291 582.2832 37.9892 6.1709 1565.1212 21.2729 318.6011 696.7071 103.0665 7.6227 5.1376 12.7769 48.1217 27.7009 233.2693 5.1064 13.4444 838.0905 409.0225 43.9355 1927.9872 87.8326 8.1049 35.6327 3.4818 6.5012 15.2981 28.0900 26.7098 25.0768 12.0954 34.2012 78.8785 14.1075 2.8674 17.8207 25.3528 174.7649 55.7540 44.8423 40.5833 34.0577 17.2193 4.0353 6.0591 3.8176 23.7326 16.4314 7.0461 17.0051 318.7923 10.9713 47.8404 58.0115 11.3132 11.3139 18.1715 110.1337 6.8577 76.1133 220.5960 24.7794 3533.3009 16.7914 1811.5693 1170.0568 755.6762 764.7831 50.3478 164.3368 124.0048 84.2286 126.7708 152.5058 38.3467 31.2771 57.3886 31.2616 56.6673 64.1505 25.4927 22.3695 48.1621 55.7942 80.8527 4.5840 8.3881 25.3489 8.8141 8.4200 8.0072 16.5417 15.8052 13.1632 1.7201 6.4014 0.3567 1.0390 8.1542 21.3135 10.8255 283.2584 324.6249 239.7360 168.2749 56.5325
temp: 298.150 k
press: 1.00000 atm
elementType: 6 6 6 6 6 6 6 6 6 6 6 6 6 6 6 6 6 6 6 6 1 1 1 1 1 1 1 1 1 1 1 1 1 1 1 1 1 1 1 1 1 7 7 45 1 6 8 8 1 8 6 6 1 1 7 1 1 6 6 1 1 6 1 1 6 1 1 8 1 1 8 1 1 6 8 8 1 6 8 8 1
symmnumber: 1
zpe: 1738863.9 jmol-1
zpe.correction: 0.662298 hartree
zpe.thermalcorrener: 0.708140 hartree
zpe.thermalcorrenthalpy: 0.709084 hartree
zpe.thermalcorrgfe: 0.580216 hartree
zpe.sumelectzpe: -2078.216264 hartree
zpe.sumelectthermal: -2078.170422 hartree
zpe.sumelectthermalent: -2078.169478 hartree
zpe.sumelectthermalfe: -2078.298345 hartree
dipole: 0.8371 4.5272 3.7257
dipole: 5.9226
quadrupole: -86.1933 -467.7978 -535.1950
quadrupole: 377.8627 287.6584 -248.9027
quadrupole: 276.8687 -104.7358 -172.1330 377.8627 287.6584 -248.9027
hfenergy: -2078.8785619 hartree
pointgroup: C01 [X(C29H39N3O9Rh1)]
dipole: 0.3293279 1.7811507 1.4658049 debye
polarizability: 570.9238252|-21.4970036|762.5064955|16.0570918|-269.8473603|650.4278514 unknown
InChI: InChI=1S/C12H8N2O4.C10H15.C6H15NO3.CO2.Rh.H/c15-11(16)7-1-3-9(13-5-7)10-4-2-8(6-14-10)12(17)18;1-6-7(2)9(4)10(5)8(6)3;8-4-1-7(2-5-9)3-6-10;2-1-3;;/h1-6,15,17H;1-5H3;8-10H,1-6H2;;;/q-2;;;;+2;
charge 0 multiplicity 2
81 atoms
C  82.40297047 -20.04006472 -38.23301658
C  82.38105709 -21.04037784 -37.3023086
C  82.72819355 -24.48534937 -34.55563862
C  82.55464534 -23.39104539 -35.35613732
C  85.01541419 -24.59361188 -35.29264033
C  84.71482712 -20.55043895 -38.64722561
C  83.60066677 -19.77421829 -38.94859994
C  83.55066662 -21.80902636 -37.04227426
C  83.99158772 -25.12923405 -34.51660667
C  83.63324484 -22.89637025 -36.14096328
C  88.2032314 -21.73230021 -37.94451242
C  88.51542452 -23.06233898 -37.48136373
C  88.20853364 -23.12681917 -36.09256818
C  87.75727007 -21.81703777 -35.66372333
C  87.78493984 -20.96018919 -36.79642032
C  89.0985614 -24.17230803 -38.28976011
C  88.475102 -21.21037589 -39.32088042
C  87.42687312 -19.50920461 -36.80435606
C  87.39178679 -21.44784884 -34.26149695
C  88.4630266 -24.30269752 -35.20580697
H  81.51233172 -19.45527922 -38.43126621
H  81.46741312 -21.25346484 -36.76120028
H  81.90692175 -24.8652235 -33.95913143
H  81.58965269 -22.90117155 -35.39903042
H  85.98561364 -25.07460279 -35.30828575
H  85.6436228 -20.38691067 -39.1808172
H  88.87558256 -24.06231771 -39.3514635
H  88.68210191 -25.13455746 -37.98503373
H  90.18581844 -24.1863051 -38.14995362
H  87.83147531 -20.36417071 -39.57215318
H  88.3205164 -21.98880957 -40.07067146
H  89.51205772 -20.86650852 -39.39717579
H  86.61575472 -19.29218443 -36.10643296
H  87.12096775 -19.17237098 -37.79642572
H  88.29835161 -18.91640156 -36.50844534
H  86.80063208 -20.53081584 -34.23228284
H  88.29448091 -21.2896898 -33.66206125
H  86.80884615 -22.24087404 -33.78617643
H  89.52160925 -24.32567917 -34.92536284
H  88.22042295 -25.23497473 -35.72118446
H  87.87921486 -24.24605175 -34.28443878
N  84.71264649 -21.50685692 -37.73021823
N  84.86521335 -23.52013541 -36.0572679
Rh 86.37843836 -22.63234256 -37.19904655
H  85.94072252 -23.64819777 -38.39890483
C  84.83309011 -24.2720874 -39.33518603
O  84.50505983 -25.25843457 -38.74972631
O  84.78187508 -23.53441584 -40.26786817
H  86.73020303 -23.84615638 -41.10308371
O  87.45362697 -24.48058385 -41.14617137
C  86.91883629 -25.71059415 -41.5969473
C  87.87064303 -26.85382026 -41.28612524
H  86.77240568 -25.69555807 -42.6872684
H  85.93288337 -25.89826828 -41.15271229
N  88.05939763 -27.16218062 -39.86925575
H  88.84493887 -26.58869088 -41.70885716
H  87.51808258 -27.74268931 -41.84424442
C  86.88196484 -27.78716908 -39.27705795
C  89.25615515 -27.98084949 -39.69205843
H  85.98856611 -27.28492276 -39.65913556
H  86.78839888 -28.85052721 -39.57014288
C  86.83109131 -27.7048992 -37.75297139
H  89.15724402 -28.58861945 -38.78867378
H  89.39100819 -28.68997831 -40.52825695
C  90.51425734 -27.13554369 -39.55228762
H  87.70483508 -28.18609436 -37.30323119
H  85.94722418 -28.26760395 -37.41739993
O  86.81398625 -26.38487038 -37.25135745
H  90.46839598 -26.58239844 -38.60544497
H  90.56737267 -26.3928527 -40.36230538
O  91.62295546 -28.01619363 -39.5865503
H  86.07754023 -25.91288796 -37.66279872
H  92.41676073 -27.49789268 -39.43153664
C  84.28362701 -26.31869383 -33.71525313
O  83.22070177 -26.75388065 -33.01329203
O  85.36447864 -26.88236283 -33.66342937
H  83.50865782 -27.53372075 -32.51926812
C  83.73964914 -18.73913323 -39.97257892
O  82.60214844 -18.05285459 -40.18648745
O  84.76609975 -18.49494799 -40.58621825
H  82.792362 -17.3960602 -40.87033576
