program: Gaussian 09
title: 000033891
version: EM64L-G09RevD.01
frameworkgroup: C1[X(C8H15N5)]
method: RPBEPBE
basis: SDD
operation: Freq
keyword: #pfreq=noraman
keyword: PBEPBE/SDD
title: #p freq=noraman PBEPBE/SDD
converged: NO YES NO NO
title: Mulliken charges:
elementType: N N N N N C C C C C C C C H H H H H H H H H H H H H H H
charge: -0.113093 -0.334981 -0.106913 -0.102858 -0.115706 0.102298 0.031486 -0.302468 0.066162 -0.607149 -0.607327 -0.717068 -0.751892 0.227249 0.228973 0.325934 0.199035 0.249063 0.251721 0.246143 0.202174 0.247136 0.222657 0.221302 0.227513 0.238130 0.234941 0.237539
chargesum: 0.00000
title: Mulliken charges with hydrogens summed into heavy atoms:
elementType: N N N N N C C C C C C C C
charge: -0.113093 -0.009047 -0.106913 -0.102858 -0.115706 0.102298 0.031486 0.153754 0.066162 0.092669 0.088126 -0.045595 -0.041283
polarizability: 1.67132506e+02 4.12177214e+00 1.44602100e+02 -4.26715664e-02 5.69281275e-01 7.44702323e+01
1716.lowfreq: -86.1309 -34.1027 -19.1678 -8.1810 -0.0006 -0.0006 -0.0006 7.8608 8.8988
frequency: -86.0930 -33.9824 -18.9885 7.8298 74.9662 97.3343 104.0500 123.6691 193.4170 201.8583 212.7649 259.9321 273.2074 302.3532 307.8017 375.1759 431.7917 520.4200 532.7809 551.6300 584.0669 610.7316 677.5309 715.8196 794.2705 798.6059 871.6764 893.8749 898.6749 980.2447 1003.3798 1050.4634 1051.0053 1056.4891 1090.0410 1107.4797 1120.8498 1145.5051 1167.9617 1193.8021 1246.5667 1257.3337 1261.2098 1311.6606 1349.5178 1380.4360 1392.4052 1396.9060 1424.3762 1428.4597 1444.9454 1447.2457 1456.5835 1460.4002 1467.4791 1477.1709 1479.3228 1483.6419 1486.9163 1499.3556 1509.5042 1533.9577 1585.0623 2982.3917 2983.3296 2984.4777 2991.0006 2994.6526 3022.9451 3060.7515 3069.6418 3079.3860 3084.5662 3093.2099 3104.0724 3113.3479 3129.7803 3566.1454
redmass: 1.1191 1.0724 1.0254 2.1330 2.3744 3.3945 2.5871 3.5772 3.0900 2.8488 5.6645 1.7526 2.6329 3.1038 2.8781 3.1697 4.1398 1.1328 4.5027 4.5156 4.4157 3.6744 5.5181 10.4847 1.1811 6.1331 4.8765 9.7755 2.2297 2.1417 2.9276 2.1308 1.6404 1.6045 2.1894 1.2349 1.3380 1.5212 3.3491 2.9346 4.2204 1.1151 4.3178 2.2011 1.9330 1.8516 1.6533 1.2462 1.6890 1.1546 1.5526 1.0450 1.1671 1.0472 1.6015 1.0408 1.1112 1.1315 1.1772 1.1127 1.8706 4.0832 5.2549 1.0473 1.0435 1.0381 1.0349 1.0400 1.1034 1.1004 1.1015 1.1011 1.0921 1.0985 1.1017 1.1000 1.1017 1.0771
irintensity: 0.4626 0.0697 0.1096 0.0484 1.9781 0.7578 1.7260 10.5513 1.5542 0.1296 0.0541 0.0280 3.0801 0.7126 0.1810 7.0894 9.9350 87.6854 2.6527 5.2286 6.9343 11.2384 1.3158 0.1868 10.8216 14.4929 2.7735 6.8025 3.9294 4.5026 6.9127 1.0311 10.5153 24.2583 0.9112 0.0094 1.1859 1.7571 12.0320 23.2922 3.6390 0.3281 2.8737 11.6537 25.7732 18.3916 42.3867 34.2810 185.9567 26.2559 138.8652 1.4619 57.2686 22.9213 148.2314 12.9217 50.5333 1.6253 36.6764 95.4504 42.3846 1219.3946 228.0536 0.8354 79.2933 33.3175 72.0253 10.3952 15.5682 19.5415 34.6486 51.2991 17.7044 32.2849 8.4965 44.9346 12.0975 58.8785
temp: 298.150 k
press: 1.00000 atm
elementType: 7 7 7 7 7 6 6 6 6 6 6 6 6 1 1 1 1 1 1 1 1 1 1 1 1 1 1 1
symmnumber: 1
zpe: 612629.2 jmol-1
zpe.correction: 0.233338 hartree
zpe.thermalcorrener: 0.246017 hartree
zpe.thermalcorrenthalpy: 0.246961 hartree
zpe.thermalcorrgfe: 0.192213 hartree
zpe.sumelectzpe: -586.620177 hartree
zpe.sumelectthermal: -586.607498 hartree
zpe.sumelectthermalent: -586.606554 hartree
zpe.sumelectthermalfe: -586.661303 hartree
dipole: 0.8933 -2.4079 0.0782
dipole: 2.5695
quadrupole: -64.9918 -73.4045 -79.6268
quadrupole: 3.1211 -0.0614 0.2413
quadrupole: 7.6825 -0.7301 -6.9524 3.1211 -0.0614 0.2413
hfenergy: -586.8535152 hartree
pointgroup: C01 [X(C8H15N5)]
dipole: 0.3400021 0.9514883 -0.0315519 debye
polarizability: 167.2287213|-3.8485859|144.5067575|0.0332671|0.5138829|74.46936 unknown
InChI: InChI=1S/C8H15N5/c1-5-9-7-10-6(2)11-8(12-7)13(3)4/h9H,5H2,1-4H3
charge 0 multiplicity 1
28 atoms
N  -1.958459 1.536373 0.000511
N  2.364994 -0.310132 -0.000529
N  0.234338 0.685607 -0.000216
N  -1.713452 -0.806547 0.015902
N  0.523994 -1.750165 0.014149
C  -1.122491 0.446482 0.00571
C  1.002136 -0.44827 0.004475
C  3.059674 0.985371 -0.012173
C  -0.837147 -1.856967 0.015915
C  -3.418717 1.328042 0.012147
C  -1.378327 2.891099 -0.004831
C  4.582616 0.775976 0.018868
C  -1.422032 -3.247147 -0.000451
H  2.763138 1.556063 -0.913814
H  2.730123 1.585974 0.857412
H  2.897877 -1.181171 0.000189
H  -3.916488 2.310747 -0.013506
H  -3.735393 0.780057 0.91744
H  -3.740308 0.730493 -0.858831
H  -0.748718 3.057768 0.88792
H  -2.196709 3.628448 -0.017036
H  -0.734958 3.043277 -0.8900
H  4.894018 0.236278 0.932177
H  4.926341 0.201589 -0.861284
H  5.100268 1.750614 0.008818
H  -2.443607 -3.236056 0.409572
H  -1.473297 -3.621286 -1.04057
H  -0.781017 -3.938816 0.569234
