program: Gaussian 16
title: Title Card Required
version: ES64L-G16RevA.03
frameworkgroup: C*V[C*(NO)]
method: UM062X
basis: def2SVP
operation: Freq
keyword: #NGeom=AllCheck
keyword: Guess=TCheck
keyword: SCRF=Check
keyword: GenChk
keyword: UM062X/def2SVP
keyword: Freq
converged: YES YES YES YES
elementType: N
1716.lowfreq: 0.0004 0.0011 0.0017 8.5786 9.7019 2149.9428
frequency: 2149.9428
redmass: 14.8673
irintensity: 41.9049
temp: 298.150 k
press: 1.00000 atm
elementType: 7 8
symmnumber: 1
zpe: 12859.5 jmol-1
zpe.correction: 0.004898 hartree
zpe.thermalcorrener: 0.007259 hartree
zpe.thermalcorrenthalpy: 0.008203 hartree
zpe.thermalcorrgfe: -0.015073 hartree
zpe.sumelectzpe: -129.733151 hartree
zpe.sumelectthermal: -129.730791 hartree
zpe.sumelectthermalent: -129.729847 hartree
zpe.sumelectthermalfe: -129.753122 hartree
hfenergy: -129.7380494 hartree
pointgroup: C*V [C*(N1O1)]
dipole: -0.0379154 0. 0. debye
dipolederiv: 0.5665175 0. 0. 0. -0.0176378 0. 0. 0. -0.0178434 -0.5665175 0. 0. 0. 0.0176378 0. 0. 0. 0.0178434 unknown
polarizability: 11.5004003|0.|5.1300634|0.|0.|4.9346387 unknown
InChI: InChI=1S/NO/c1-2
charge 0 multiplicity 2
2 atoms
N  0.27710085 2.30183579 0.0000
O  -0.86069099 2.30183579 0.0000
