program: Gaussian 16
title: Title Card Required
version: ES64L-G16RevA.03
frameworkgroup: C1[X(CH3NOS)]
method: RM062X
basis: def2SVP
operation: Freq
keyword: #N
keyword: Geom=AllCheck
keyword: Guess=TCheck
keyword: SCRF=Check
keyword: GenChk
keyword: RM062X/def2SVP
keyword: Freq
converged: YES YES YES YES
title: Mulliken charges:
elementType: C H H H S N O
charge: -0.196194 0.103789 0.101161 0.103790 0.063515 -0.002548 -0.173513
chargesum: -0.00000
title: Mulliken charges with hydrogens summed into heavy atoms:
elementType: C S N O
charge: 0.112546 0.063515 -0.002548 -0.173513
1716.lowfreq: -27.7899 -6.5060 -0.0017 -0.0009 0.0022 16.3578 80.0081 254.9541 291.2654
frequency: 79.7205 254.9541 291.2435 446.7934 685.1266 743.1081 958.4290 960.5426 1319.6626 1431.7509 1441.0574 1777.4002 3079.7290 3190.2155 3204.3580
redmass: 1.0486 3.7066 8.5921 14.6558 6.2514 5.0437 1.4694 1.2079 1.1713 1.0478 1.0507 14.2208 1.0301 1.1086 1.1071
irintensity: 0.0139 4.4658 0.0348 79.5079 83.2539 4.4069 16.7860 5.0743 4.5595 13.4174 8.1795 370.4304 4.3098 0.3946 0.3540
temp: 298.150 k
press: 1.00000 atm
elementType: 6 1 1 1 16 7 8
symmnumber: 1
zpe: 118813.7 jmol-1
zpe.correction: 0.045254 hartree
zpe.thermalcorrener: 0.050364 hartree
zpe.thermalcorrenthalpy: 0.051308 hartree
zpe.thermalcorrgfe: 0.016908 hartree
zpe.sumelectzpe: -567.598544 hartree
zpe.sumelectthermal: -567.593434 hartree
zpe.sumelectthermalent: -567.592490 hartree
zpe.sumelectthermalfe: -567.626890 hartree
dipole: 1.9544 1.0373 -0.0001
dipole: 2.2126
quadrupole: -31.0510 -31.2316 -30.0808
quadrupole: 1.8093 -0.0001 -0.0001
quadrupole: -0.2632 -0.4438 0.7070 1.8093 -0.0001 -0.0001
hfenergy: -567.6437978 hartree
pointgroup: C01 [X(C1H3N1O1S1)]
dipole: -0.7216848 0.4798521 -0.0818627 debye
dipolederiv: -0.0539076 -0.0762417 0.0391843 0.0172554 0.0424173 -0.0314545 -0.0019608 -0.01474 -0.0147539 0.0452074 -0.0460008 -0.0345812 0.0319273 -0.0407795 -0.0091273 -0.048104 0.0100471 0.0469896 0.0040817 0.0249312 0.0099885 0.0491267 0.0703305 0.0132171 -0.0006455 0.0175109 0.1125941 0.0685874 -0.0024135 0.0426684 0.0620414 -0.0009818 0.0286387 -0.0063797 0.035041 -0.0164622 -0.9198861 -0.0606804 0.1934478 0.0001419 0.1474325 -0.0593199 0.166666 -0.0485087 0.0039447 1.6607577 0.2573901 -0.427459 1.069065 0.1459895 -0.2979798 -0.784455 -0.1527946 0.1107848 -0.8048405 -0.0969849 0.1767511 -1.2295577 -0.3644085 0.3560259 0.674879 0.1534442 -0.2430972 unknown
polarizability: 49.0995998|-0.8335613|35.3367344|-4.1803317|-4.9767238|26.6165076 unknown
InChI: InChI=1S/CH3NOS/c1-4-2-3/h1H3
charge 0 multiplicity 1
7 atoms
C  1.01892461 1.17335648 -0.22107941
H  1.56232573 1.95129049 0.33010276
H  -0.06144907 1.29828338 -0.08133113
H  1.27068891 1.23985868 -1.28713916
S  1.44576441 -0.45417345 0.4181495
N  3.20351657 -0.45201298 0.10280671
O  3.62926184 0.5221234 -0.40170727
