program: Gaussian 09
title: 000033897
version: EM64L-G09RevD.01
frameworkgroup: C1[X(C10H16Cl3N5)]
method: RPBEPBE
basis: SDD
operation: Freq
keyword: #p
keyword: freq=noraman
keyword: PBEPBE/SDD
title: #p freq=noraman PBEPBE/SDD
converged: NO YES NO NO
title: Mulliken charges:
elementType: Cl Cl Cl N N N N N C C C C C C C C C C H H H H H H H H H H H H H H H H
charge: 0.089785 0.112039 0.089378 -0.115674 -0.111306 -0.070940 -0.332979 -0.048553 -0.354260 -0.353023 0.112968 -0.663224 -0.663006 0.045830 0.273633 -0.306314 -0.755884 -0.714692 0.264929 0.207456 0.252045 0.211981 0.206241 0.252765 0.218324 0.212811 0.244589 0.215927 0.336498 0.230227 0.232345 0.225600 0.224015 0.230469
chargesum: 0.00000
title: Mulliken charges with hydrogens summed into heavy atoms:
elementType: Cl Cl Cl N N N N N C C C C C C C C C C
charge: 0.089785 0.112039 0.089378 -0.115674 -0.111306 -0.070940 0.003520 -0.048553 0.118124 0.111002 0.112968 0.014106 0.010321 0.045830 0.273633 0.156258 -0.755884 -0.034607
polarizability: 1.99259359e+02 5.46550807e-01 2.24856237e+02 -1.94436620e+00 -7.29946658e-01 1.27339004e+02
1716.lowfreq: -15.6583 -7.3442 0.0023 0.0023 0.0026 4.5191 7.5747 9.2557 41.0402
frequency: -13.6365 7.4745 40.9223 44.6397 58.1060 62.0291 83.3669 91.1817 116.7994 130.6290 174.7751 176.4995 202.2366 207.4098 214.5522 221.4272 225.2719 262.8440 265.0999 292.1143 299.5457 305.9002 323.5142 366.2383 387.6216 442.7342 504.7343 538.5291 539.1617 564.0885 618.9169 645.9338 696.1886 710.8347 753.6048 766.5795 778.0832 779.0841 794.4610 809.4326 850.2190 891.2285 905.8518 937.8989 987.0953 1020.7100 1048.6134 1076.3473 1080.3578 1089.4289 1098.4462 1144.7911 1160.5955 1184.8327 1204.2844 1238.7002 1259.2749 1271.1714 1308.5045 1311.4942 1339.4130 1348.7889 1362.9059 1381.9681 1386.3906 1390.9219 1399.8689 1431.7432 1455.3347 1458.9368 1466.9211 1469.3618 1478.5735 1479.9921 1481.9397 1484.2142 1496.5945 1506.4828 1541.0887 1589.7540 2985.2943 2985.7175 2985.8980 2986.6303 3007.4075 3012.9984 3027.7953 3072.6200 3073.9931 3081.4486 3087.6297 3090.9036 3095.6502 3102.3658 3105.2881 3561.4534
redmass: 2.3099 11.5154 3.0433 3.2415 2.7507 3.8564 4.1294 4.7400 3.4325 4.5305 3.6899 8.5579 3.6976 2.5466 1.8635 2.8536 2.0602 1.5991 2.4477 4.8865 6.9012 3.3766 2.9042 13.2837 2.9018 5.5536 4.4564 1.4830 1.9989 3.9933 11.7651 8.1479 7.3672 10.3768 10.2143 4.9506 1.4530 1.2136 1.1136 11.0500 2.4361 13.2500 2.2235 2.0594 3.2045 4.8084 2.8994 2.1159 1.9353 2.3598 1.8357 1.5235 3.2131 2.5796 3.4340 2.7430 1.1067 2.8840 1.5116 1.5446 1.6722 1.2329 1.3240 1.2159 1.2173 2.2483 1.2505 4.3059 1.1311 1.1871 1.0465 1.0490 1.0402 1.0704 1.0538 1.0573 1.1167 2.6590 5.5704 6.5129 1.0540 1.0369 1.0360 1.0402 1.0638 1.0638 1.1034 1.0997 1.0994 1.1012 1.0983 1.0977 1.0985 1.1025 1.1027 1.0774
irintensity: 0.0243 0.0111 0.0778 0.0303 0.0591 1.5674 0.6563 2.0147 0.9373 2.1723 1.3818 2.0730 0.2922 1.0214 0.9072 0.1872 0.0542 0.4919 0.1674 1.5376 1.2020 1.2696 0.2741 2.1893 3.0652 11.6289 5.1772 56.3990 34.2452 4.8306 55.6240 26.1476 62.5186 1.1485 134.0267 143.0407 21.4468 1.5042 3.8604 0.0788 8.4977 27.4361 1.9896 1.8776 21.6126 27.1413 6.7117 12.4577 24.9384 4.5112 13.5702 1.8783 9.8398 18.0326 9.7924 14.0594 0.3294 0.0805 59.6061 26.7464 51.6221 3.1177 40.7920 16.0671 34.3889 66.6705 38.4720 206.7455 55.7703 38.1301 2.5203 6.1403 13.5678 27.5502 7.5246 14.0753 87.4965 51.5488 1300.5616 287.3857 23.6057 27.4802 32.6343 30.1179 29.7069 57.7045 12.9775 13.3935 9.6480 45.9125 36.1907 27.8708 29.7200 17.4736 38.9810 73.6004
temp: 298.150 k
press: 1.00000 atm
elementType: 17 17 17 7 7 7 7 7 6 6 6 6 6 6 6 6 6 6 1 1 1 1 1 1 1 1 1 1 1 1 1 1 1 1
symmnumber: 1
zpe: 686576.9 jmol-1
zpe.correction: 0.261503 hartree
zpe.thermalcorrener: 0.281413 hartree
zpe.thermalcorrenthalpy: 0.282357 hartree
zpe.thermalcorrgfe: 0.209976 hartree
zpe.sumelectzpe: -2043.218282 hartree
zpe.sumelectthermal: -2043.198372 hartree
zpe.sumelectthermalent: -2043.197428 hartree
zpe.sumelectthermalfe: -2043.269810 hartree
dipole: -6.2896 -0.2705 -0.2743
dipole: 6.3014
quadrupole: -125.3560 -109.4053 -129.1756
quadrupole: -3.5150 0.2286 -0.9130
quadrupole: -4.0437 11.9070 -7.8633 -3.5150 0.2286 -0.9130
hfenergy: -2043.4797852 hartree
pointgroup: C01 [X(C10H16Cl3N5)]
dipole: 2.3503118 0.7792438 -0.1229147 debye
polarizability: 200.9052983|-6.2622368|223.229459|1.2169365|1.2247134|127.3198426 unknown
InChI: InChI=1S/C10H16Cl3N5/c1-4-14-8-15-7(10(11,12)13)16-9(17-8)18(5-2)6-3/h14H,4-6H2,1-3H3
charge 0 multiplicity 1
34 atoms
Cl -3.072546 -2.157314 1.647741
Cl -3.940794 0.351898 0.222063
Cl -3.24537 -2.103814 -1.380333
N  0.679704 2.243536 0.013501
N  1.322236 -0.027028 -0.070827
N  -1.031537 0.627835 0.066545
N  1.804533 -2.328631 -0.168882
N  -0.443399 -1.722095 -0.021599
C  -0.353282 3.303323 0.122319
C  2.100693 2.648332 -0.086341
C  0.327428 0.92125 0.001987
C  -0.881085 3.757837 -1.254375
C  2.776792 2.775037 1.295744
C  0.884837 -1.322708 -0.086019
C  -1.319034 -0.692036 0.054679
C  3.257561 -2.109452 -0.252724
C  -2.799671 -1.099205 0.131792
C  3.999286 -3.455157 -0.28704
H  -1.187522 2.909668 0.724401
H  0.102641 4.151671 0.665986
H  2.630124 1.893612 -0.690262
H  2.133941 3.613152 -0.625899
H  -0.062898 4.115592 -1.906009
H  -1.393565 2.920285 -1.756913
H  -1.606405 4.582738 -1.130527
H  2.249848 3.503811 1.938028
H  2.780722 1.796884 1.805789
H  3.823089 3.113047 1.180881
H  1.426121 -3.277501 -0.176404
H  3.487706 -1.513087 -1.156813
H  3.584833 -1.504118 0.613987
H  3.800983 -4.045726 0.626123
H  3.700723 -4.057362 -1.16493
H  5.087907 -3.286375 -0.349771
