program: Gaussian 16
title: TS1 guess1
version: ES64L-G16RevA.03
basis: 6-311++G(d,p)
frameworkgroup: C1[X(C16H36N2O4)]
method: RwB97XD
operation: FTS
keyword: #p
keyword: opt(ts,calcfc,noeigentest)
keyword: wb97xd/6-311++g(d,p)
title: #p opt(ts,calcfc,noeigentest) wb97xd/6-311++g(d,p)
title: TS1 guess 1
nucrepener: 2151.7380876802
basis: NPDir=0 NMtPBC= 1 NCelOv= 1 NCel= 1 NClECP= 1 NCelD= 1
basis: NCelK= 1 NCelE2= 1 NClLst= 1 CellRange= 0.0.
basis: One-electron integrals computed using PRISM.
basis: One-electron integral symmetry used in STVInt
basis: NBasis= 736 RedAO= T EigKep= 2.00D-06 NBF= 736
basis: NBsUse= 736 1.00D-06 EigRej= -1.00D+00 NBFU= 736
converged: YES YES YES YES
title: Mulliken charges with hydrogens summed into heavy atoms:
elementType: C O O C O C C C O C C C C C N C C C N C C C
charge: 0.174550 -0.022919 0.149565 -0.854825 -0.279243 0.088202 0.155726 -1.303925 0.044529 0.028730 0.466680 0.052335 0.082168 -0.219558 0.446914 -0.001277 0.256695 -0.144066 0.905904 0.072451 0.041731 -0.140369
chargesum: -0.00000
title: Mulliken charges:
elementType: C O O C O C H H H C H H H C O C H H H C H H C H H C H H C H H H N H H C H H C H H C H H H N H H C H H C H H C H H H
charge: 0.118131 -0.113423 0.157215 -0.599392 -0.267552 -0.455268 0.156672 0.208900 0.173788 -0.475773 0.210430 0.195142 0.168554 -1.279112 0.056044 -0.453168 0.245649 0.177395 0.180854 0.215167 0.200997 0.050048 -0.442022 0.174987 0.139240 -0.089453 0.145621 0.133232 -0.694282 0.154737 0.149664 0.150941 0.191672 0.583463 0.264092 -0.289593 0.145722 0.192463 -0.165664 0.126000 0.185013 -0.657073 0.190802 0.143360 0.142766 -0.476402 0.324829 0.429389 -0.384417 0.101840 0.264452 -0.202639 0.180611 0.150986 -0.639830 0.185716 0.168043 0.150435
dipole: 3.5556 5.1416 -3.8895
dipole: 7.3625
quadrupole: -136.3973 -128.4005 -145.0509
quadrupole: 3.5158 3.8236 -0.2160
quadrupole: 0.2189 8.2157 -8.4347 3.5158 3.8236 -0.2160
hfenergy: -1041.7744998 hartree
pointgroup: C01 [X(C16H36N2O4)]
dipole: 2.5564466 1.3128415 0.3626237 debye
InChI: InChI=1S/C13H26NO4.C3H10N/c1-6-8-10-17-11(15)18-12(3,4)13(5,16)14-9-7-2;1-2-3-4/h14H,6-10H2,1-5H3;2-3H2,1,4H3
charge 0 multiplicity 1
58 atoms
C  1.41034875 -1.76703098 0.88475871
O  2.07259192 0.39754835 1.40222289
O  0.52991499 -1.37645868 1.94381476
C  0.9460213 -0.27825671 2.65737386
O  1.62136781 -0.39769547 3.70556859
C  2.57034056 -2.57900445 1.46201134
H  3.11283429 -2.00682392 2.21452374
H  2.1669696 -3.46519531 1.95675788
H  3.25042028 -2.89530544 0.66781099
C  0.60661069 -2.63473517 -0.06906662
H  1.19884205 -2.8275777 -0.96744392
H  0.36476662 -3.59032083 0.40184241
H  -0.32752868 -2.1495036 -0.35190999
C  1.85192818 -0.3937588 0.27539825
O  -0.07833445 0.62277648 2.60900356
C  0.7358468 0.23563629 -0.56576006
H  -0.19611048 0.25003544 -0.00066581
H  1.01782951 1.270343 -0.77947592
H  0.58108629 -0.29686403 -1.50799118
C  0.11189716 1.79994532 3.36941512
H  0.26792536 1.54359189 4.42281349
H  1.00755378 2.32229365 3.00315528
C  -1.11111967 2.67833051 3.19473646
H  -1.99426301 2.12382467 3.52978063
H  -1.25179232 2.88298434 2.12783904
C  -0.99535811 3.99059807 3.96664146
H  -0.84209982 3.77499419 5.03080372
H  -0.10300857 4.53308509 3.63068729
C  -2.22299632 4.88189163 3.7999656
H  -2.11902984 5.81580409 4.35837673
H  -2.38212243 5.13600654 2.74765074
H  -3.12461124 4.37593105 4.15786983
N  3.02544111 -0.53927162 -0.59071077
H  3.33129903 0.71961716 2.22152957
H  2.91498238 0.06718668 -1.39316687
C  4.34318452 -0.32085968 -0.0226264
H  4.48237183 0.71447624 0.33639317
H  4.47248085 -0.97419388 0.84166824
C  5.43789322 -0.63832267 -1.03297443
H  5.30368838 -0.01352392 -1.92428345
H  5.32220585 -1.67592743 -1.36044823
C  6.83205645 -0.41460464 -0.45415215
H  7.61092755 -0.64946965 -1.18324637
H  6.97060311 0.62702399 -0.14582183
H  6.99829332 -1.04828664 0.42342435
N  3.79724306 0.85291329 3.18871696
H  3.88608121 1.84079422 3.40631329
H  2.98787483 0.42112292 3.73028787
C  5.06145877 0.11902337 3.37722688
H  4.85243186 -0.9279003 3.14791424
H  5.78694957 0.47916418 2.64275502
C  5.59596068 0.25451237 4.79473958
H  4.83120952 -0.09331586 5.49669126
H  5.77434195 1.3134816 5.01711445
C  6.88501915 -0.53808906 4.98892534
H  7.2597203 -0.43061393 6.00848067
H  6.72159542 -1.60334625 4.80387364
H  7.66788169 -0.19470009 4.30640937
