program: Gaussian 16
title: TS1 guess1
version: ES64L-G16RevA.03
basis: 6-311++G(d,p)
frameworkgroup: C1[X(C13H27NO4)]
method: RwB97XD
operation: FTS
keyword: #p
keyword: opt(ts,calcfc,noeigentest)
keyword: wb97xd/6-311++g(d,p)
title: #p opt(ts,calcfc,noeigentest) wb97xd/6-311++g(d,p)
title: TS1 guess 1
nucrepener: 1578.0839710426
basis: NPDir=0 NMtPBC= 1 NCelOv= 1 NCel= 1 NClECP= 1 NCelD= 1
basis: NCelK= 1 NCelE2= 1 NClLst= 1 CellRange= 0.0.
basis: One-electron integrals computed using PRISM.
basis: One-electron integral symmetry used in STVInt
basis: NBasis= 585 RedAO= T EigKep= 2.04D-06 NBF= 585
basis: NBsUse= 585 1.00D-06 EigRej= -1.00D+00 NBFU= 585
converged: YES YES YES YES
title: Mulliken charges with hydrogens summed into heavy atoms:
elementType: C C O O O C C C C N C C C O C C C C
charge: 0.029344 0.142276 -0.209593 0.120093 -0.115289 -1.108753 0.151268 0.227470 0.049870 0.484275 -0.077848 0.444015 -0.355329 0.188796 -0.191348 0.364766 0.103362 -0.247375
chargesum: -0.00000
title: Mulliken charges:
elementType: C C O O O C C H H C H H H C H H H N H H C H H C H H C H H H O C H H C H H C H H C H H H H
charge: 0.124465 0.256154 -0.215912 0.117990 -0.037821 -1.321588 -0.445200 0.220817 0.216890 -0.389912 0.228505 0.209361 0.183753 -0.557987 0.197613 0.218381 0.175365 -0.170167 0.190492 0.658173 -0.525736 0.232124 0.232114 0.026359 0.129383 0.263864 -0.853672 0.180350 0.163327 0.152937 -0.362852 -0.395111 0.175658 0.162880 0.009671 0.162847 0.112545 -0.267099 0.145399 0.139710 -0.679248 0.164088 0.141039 0.153374 0.476676
dipole: 0.6452 1.2167 2.0582
dipole: 2.4765
quadrupole: -114.7599 -109.8050 -120.8183
quadrupole: 6.5704 -11.5185 4.5092
quadrupole: 0.3679 5.3227 -5.6906 6.5704 -11.5185 4.5092
hfenergy: -867.2828009 hartree
pointgroup: C01 [X(C13H27N1O4)]
dipole: 0.0877613 -0.6961605 0.6759872 debye
InChI: InChI=1S/C13H27NO4/c1-6-8-10-16-19-18-13(5)12(3,4)17-11(15)14(13)9-7-2/h14H,6-10H2,1-5H3
charge 0 multiplicity 1
45 atoms
C  -2.8614515 0.35989383 -0.34805805
C  -1.12196743 1.70051878 0.40418133
O  -0.50238643 2.66302035 0.73427084
O  -2.3955889 1.68160758 0.07635023
O  -1.52776542 -1.69523101 -0.48095937
C  -1.81841206 -0.64794132 0.28237061
C  -2.17114475 -1.05525367 1.70930185
H  -3.06890993 -1.67182325 1.6724026
H  -2.35724598 -0.20435477 2.3713001
C  -2.86171139 0.33413657 -1.86803727
H  -3.20792784 -0.64194224 -2.21003053
H  -3.53853845 1.10740371 -2.23735104
H  -1.86804205 0.49526014 -2.28564498
C  -4.27373703 0.20427202 0.18631715
H  -4.93475801 0.91858086 -0.30803948
H  -4.63316075 -0.80385919 -0.03232459
H  -4.32690334 0.37426558 1.26163139
N  -0.56661858 0.35737304 0.33976789
H  -1.37242308 -1.66987903 2.12391701
H  -0.10069899 0.1408119 -0.67254377
C  0.48963703 0.13680414 1.36367759
H  0.02071347 0.1655064 2.34982025
H  1.16164622 0.9945164 1.30135016
C  1.25268648 -1.16540358 1.16194922
H  1.8394443 -1.10040806 0.24268984
H  0.55453183 -1.99371971 1.02322705
C  2.17555067 -1.43305297 2.34674935
H  2.75301907 -2.34600235 2.1887248
H  2.88294772 -0.61174001 2.49547401
H  1.60559256 -1.55498654 3.27281924
O  0.06403564 -0.61051892 -1.86502123
C  1.23807466 -1.18977089 -2.38228577
H  1.33299365 -0.91138765 -3.4403298
H  2.11971035 -0.77166106 -1.87158945
C  1.24904234 -2.70755772 -2.25244106
H  0.38138249 -3.11346654 -2.78564343
H  1.11608657 -2.98025641 -1.19917619
C  2.53172844 -3.33440595 -2.7922675
H  2.66155437 -3.05006811 -3.84318335
H  3.39295312 -2.91918636 -2.25455797
C  2.54152308 -4.85578069 -2.67073097
H  3.4690407 -5.28289593 -3.06058992
H  2.44240324 -5.16586589 -1.62595949
H  1.7091129 -5.29789779 -3.22626604
H  -0.71356308 -1.30765105 -1.33707846
