program: Gaussian 16
title: Input
version: ES64L-G16RevA.03
basis: def2SVP
method: RB3LYP
operation: Freq
keyword: #
keyword: b3lyp/Def2SVP
keyword: freq=noraman
keyword: temperature=403.15
keyword: EmpiricalDispersion=GD3BJ
title: # b3lyp/Def2SVP freq=noraman temperature=403.15 EmpiricalDispersion=GD
nucrepener: 2969.3152291876
converged: YES YES NO NO
title: Mulliken charges:
elementType: H C C C C C C H H H C C N C C C H H H H Rh C C C C C C H H H C H H H C H H H C H H H C H H H H O C O C H H H
charge: 0.012260 -0.024198 -0.065940 0.090029 -0.031477 0.035490 0.040450 0.012290 0.016857 -0.006828 0.121382 -0.011722 -0.210235 0.089766 0.105181 0.014537 0.013640 0.034116 0.065448 0.028655 -0.086596 -0.088890 -0.155078 -0.117798 -0.093740 -0.131009 0.137651 0.024642 0.058180 0.043946 0.126120 0.048303 0.025723 0.043977 0.141332 0.025420 0.039403 0.043444 0.132099 0.037983 0.052151 0.029966 0.134108 0.050078 0.018120 0.047076 0.274748 -0.285487 0.210983 -0.338605 0.063691 0.057378 0.057115 0.043863
chargesum: 1.00000
title: Mulliken charges with hydrogens summed into heavy atoms:
elementType: C C C C C C C C N C C C Rh C C C C C C C C C C O C O C
charge: -0.011938 0.208809 0.090029 -0.038305 0.052348 0.052740 0.121382 0.001918 -0.210235 0.123882 0.170629 0.043192 -0.086596 -0.088890 -0.155078 -0.117798 -0.093740 -0.131009 0.264420 0.244124 0.249598 0.252199 0.249382 -0.285487 0.210983 -0.338605 0.222047
1716.lowfreq: -955.0988 -0.0001 0.0002 0.0006 3.3769 4.9080 10.8606 21.0971 24.4879
frequency: -955.0988 21.0728 24.4869 43.1825 50.8564 70.8301 81.2294 100.6196 105.3025 106.0004 128.7234 132.6242 137.9606 142.9315 144.6329 155.6456 160.7317 162.0941 172.9787 177.6867 196.7454 206.0904 216.8341 245.3081 259.0301 261.5377 278.1511 288.8854 298.4881 318.6572 324.0647 332.4535 365.5401 413.5454 423.8618 441.7364 446.0937 458.4703 471.6795 505.1954 540.2514 542.9140 559.8117 562.2971 571.3395 598.3544 619.4338 634.5105 639.0550 644.5921 661.4118 677.0851 697.0403 761.6393 770.5259 780.2367 781.3527 813.0117 819.4106 824.4937 908.4796 915.7077 956.2996 961.7241 964.4965 989.9150 995.1246 1023.7814 1028.2453 1029.8354 1031.6170 1033.9922 1035.6498 1037.6928 1041.6517 1043.2737 1044.9547 1052.2689 1053.5767 1069.9018 1084.2869 1089.7130 1092.1830 1118.5065 1125.3826 1138.6781 1173.6625 1179.7965 1184.5838 1187.3049 1226.8210 1284.5017 1314.4115 1324.5603 1335.3820 1340.6850 1367.1961 1382.0934 1384.0853 1386.0418 1396.1526 1398.5739 1399.8608 1424.4528 1427.6016 1431.0678 1436.1337 1438.9616 1442.7691 1445.5441 1450.4093 1454.5854 1455.8040 1458.2575 1461.1341 1464.4834 1474.8299 1480.7675 1486.6530 1491.2171 1494.9652 1498.0305 1514.2925 1522.0317 1535.5592 1610.0468 1625.0112 1640.6266 1661.1430 1687.3412 3036.9590 3041.6272 3042.5915 3043.1625 3044.2394 3054.6683 3114.6375 3121.1049 3122.2169 3122.9926 3126.6352 3140.9930 3147.6730 3156.0065 3157.4326 3160.3456 3167.8973 3181.8170 3184.1721 3189.2577 3198.3831 3203.1722 3208.8426 3209.3987 3223.0501 3226.5035
redmass: 1.1704 3.8371 1.0193 4.5720 5.0567 4.0350 5.0680 3.4801 2.5388 1.2131 1.2778 1.5451 1.2374 2.7898 1.7494 2.4175 2.8150 2.7757 2.9428 3.1021 1.9587 2.7598 5.6424 4.4003 5.0881 4.7386 3.2769 2.3963 2.2876 3.5931 4.1011 4.7895 6.5185 5.3470 3.5604 3.7306 4.0810 4.0241 3.5586 4.2308 4.2908 4.2057 4.1730 2.4673 2.9161 3.9395 2.6358 3.8030 3.6794 6.7231 6.5712 6.3754 5.4798 4.0434 1.6882 1.7477 2.5108 2.3054 2.3240 2.2734 1.3034 1.4960 1.4740 1.4682 4.9900 1.4030 1.4132 1.8177 1.4211 1.4716 1.4774 3.1311 1.4916 1.3719 1.6313 2.6177 2.0874 5.4365 1.8966 2.1795 1.7459 1.8920 1.8875 1.7696 1.6527 1.4711 1.0924 1.0952 3.6627 3.6404 1.2364 1.6157 1.3440 1.9053 2.4377 2.7322 1.2662 1.4044 1.4425 2.6892 1.2261 1.2171 1.2328 1.5207 1.1004 1.3656 1.3664 1.1814 1.0978 1.1255 1.0741 1.1073 2.1415 1.5422 1.2559 1.0841 1.4350 2.3894 1.8490 2.7062 3.0381 2.3923 3.3734 3.2345 4.4035 5.3698 6.4332 5.6264 6.2347 6.0429 1.0423 1.0440 1.0436 1.0416 1.0427 1.0387 1.0961 1.0962 1.0981 1.0962 1.0945 1.0979 1.1042 1.1042 1.1034 1.1032 1.1023 1.1086 1.0873 1.0902 1.0945 1.0901 1.0984 1.0932 1.0949 1.0999
irintensity: 2413.3149 0.2107 0.3620 0.5564 0.0803 1.2076 1.2315 0.9620 4.0293 0.5768 0.6193 0.2095 0.4307 2.8735 0.9884 1.6625 1.3016 1.8404 0.7546 2.0389 0.8711 3.0891 1.8405 1.5589 2.6044 2.9536 4.1050 0.9623 0.4927 1.4017 1.3675 9.8742 4.1600 9.0746 3.7268 0.7662 4.0596 1.6952 8.9968 2.5788 1.5773 3.3923 7.2259 0.2594 0.0364 0.9638 4.2427 3.4019 4.3680 1.3171 14.7628 13.2219 48.9488 7.8289 11.4850 56.9652 33.6890 1.2208 1.0122 1.2400 0.6944 1.0889 0.6723 0.7289 7.2932 1.3084 1.5041 7.1362 29.6281 12.1241 10.1359 10.2710 2.9921 0.9158 0.0487 2.0867 1.1768 7.9442 6.9959 3.2007 6.4560 9.1135 7.1332 0.5473 18.2859 2.5379 4.0276 1.1844 3.2595 5.2754 24.6626 11.0009 178.0426 134.4381 57.5396 48.0538 5.7765 3.0569 1.2406 18.8923 2.6485 9.6990 4.6481 6.8285 63.4553 3.1563 0.5166 3.0689 2.1977 32.4959 0.0980 2.2735 12.7013 28.3845 10.3347 3.2005 20.1969 27.0040 25.4642 90.5774 152.9130 10.8370 21.6993 30.1959 36.3687 3.4383 5.3523 7.3870 52.2569 439.8088 5.7926 1.2511 6.1165 5.2272 2.6728 0.2335 1.6727 0.5649 1.0216 1.2945 1.3599 2.0206 4.7140 4.5587 2.6420 3.9647 3.1353 0.8974 1.8800 0.5580 4.3103 0.9865 3.7153 0.6275 0.0645 0.1718
temp: 403.150 k
press: 1.00000 atm
elementType: 1 6 6 6 6 6 6 1 1 1 6 6 7 6 6 6 1 1 1 1 45 6 6 6 6 6 6 1 1 1 6 1 1 1 6 1 1 1 6 1 1 1 6 1 1 1 1 8 6 8 6 1 1 1
symmnumber: 1
zpe: 1158241.6 jmol-1
zpe.correction: 0.441151 hartree
zpe.thermalcorrener: 0.489447 hartree
zpe.thermalcorrenthalpy: 0.490724 hartree
zpe.thermalcorrgfe: 0.349339 hartree
zpe.sumelectzpe: -1207.276857 hartree
zpe.sumelectthermal: -1207.228561 hartree
zpe.sumelectthermalent: -1207.227284 hartree
zpe.sumelectthermalfe: -1207.368669 hartree
dipole: 0.1459 -0.6612 -3.5988
dipole: 3.6620
quadrupole: -129.9948 -132.1110 -153.7118
quadrupole: 3.8417 7.5574 4.2122
quadrupole: 8.6111 6.4948 -15.1059 3.8417 7.5574 4.2122
hfenergy: -1207.7180079 hartree
pointgroup: C01 [X(C23H27N1O2Rh1)]
dipole: 0.0574199 -0.260145 -1.4158902 debye
polarizability: 325.5372185|-8.5352208|321.2491455|3.7216357|15.994588|247.0929766 unknown
InChI: InChI=1S/C13H12NO2.C10H15.Rh/c1-10(15)16-17-13-8-3-2-6-11(13)12-7-4-5-9-14-12;1-6-7(2)9(4)10(5)8(6)3;/h2-9H,1H3;1-5H3;/q-2;;+2
charge 1 multiplicity 1
54 atoms
H  -0.154629 2.61465 2.129001
C  -0.988596 2.38111 1.463773
C  -1.082881 1.097544 0.902615
C  -2.221436 0.79365 0.104258
C  -3.200281 1.762692 -0.142826
C  -3.064432 3.040603 0.406528
C  -1.966429 3.34805 1.219188
H  -1.882893 4.339981 1.669118
H  -3.825178 3.798375 0.207607
H  -4.060849 1.537197 -0.776208
C  -2.284972 -0.578746 -0.420017
C  -3.450712 -1.24029 -0.828734
N  -1.093682 -1.228853 -0.446959
C  -3.377597 -2.569357 -1.238812
C  -1.018741 -2.515214 -0.815807
C  -2.142652 -3.226177 -1.224018
H  -4.407432 -0.719062 -0.796523
H  -4.280533 -3.096775 -1.553465
H  -0.028211 -2.972414 -0.776074
H  -2.048547 -4.271683 -1.519902
Rh 0.590431 -0.068798 0.034537
C  1.310301 0.146277 -2.021062
C  1.08396 1.44406 -1.446867
C  1.99727 1.591705 -0.321452
C  2.72995 0.375128 -0.18697
C  2.300135 -0.538487 -1.228328
C  3.759239 0.057773 0.845117
H  3.785024 0.813695 1.640137
H  3.558882 -0.920355 1.305633
H  4.758262 0.015928 0.380582
C  2.211466 2.837104 0.475048
H  3.10388 3.364818 0.098143
H  1.359726 3.522129 0.393908
H  2.381218 2.619494 1.538518
C  0.181437 2.504196 -1.988991
H  -0.66487 2.06861 -2.536204
H  -0.22834 3.131641 -1.18725
H  0.732871 3.157427 -2.685785
C  0.619993 -0.404354 -3.224206
H  -0.397035 -0.00325 -3.326897
H  1.181968 -0.127808 -4.131925
H  0.558265 -1.500209 -3.194201
C  2.868817 -1.898671 -1.467986
H  3.064123 -2.418654 -0.519637
H  2.193787 -2.522196 -2.070082
H  3.825136 -1.82765 -2.013529
H  -0.772553 0.174965 1.783916
O  -0.738506 -0.682946 2.801896
C  0.219359 -1.4760 2.616534
O  0.948499 -1.458195 1.571861
C  0.51129 -2.525974 3.657037
H  -0.139215 -3.394388 3.463177
H  0.270217 -2.142789 4.65695
H  1.556413 -2.854415 3.601332
